{"text_format":"1","workbook":"xlsx","n_sheets":19,"sheets":["Main","Project Info","Turbine Selection","LCC Assumption","Capital Costs","O&M Costs","Benefits","GHG Emissions","Output","Glossary","Turbine calculation","Cost Reference","Dropdown","LCC Assumption - Hidden","Energy, Labor Hidden","LCC Capital ","LCC O&M","Payback Period","PB - dont use"],"not_rendered":{"charts":4,"images":8,"macros":1,"external_links":4,"defined_names":254,"comments":0,"pivot_tables":0},"unopened":[],"bounds":{"document_bytes":16777216,"sheet_cells":100000,"rows_first":2000,"rows_last":500,"rows_between":2000,"halvings":0,"cell_chars":16384,"cell_head_chars":4096},"cells_cut":0,"cells_raw":0,"read":"whole","date_system":"1900"}

{"sheet":"Main","index":0,"n_rows":20,"n_cols":3,"rows_kept":20,"cut":false,"hidden":false,"merged":[[6,2,8,7],[14,2,14,7],[19,2,19,7]]}
[]
[]
[]
[]
[null,"  Background"]
[]
[null,null,"California's In-Conduit Hydropower Implementation Guidebook: A Compendium of Resources, Best Practices, and Tools"]
[]
[]
[]
{"$rows_left_out":11}
{"sheet":"Project Info","index":1,"n_rows":25,"n_cols":5,"rows_kept":25,"cut":false,"hidden":false,"merged":[[3,4,3,8],[5,4,5,8],[6,4,6,8],[11,4,11,8],[24,4,24,7],[12,4,12,8],[21,4,21,7],[22,4,22,7],[23,4,23,7],[4,4,4,8],[14,4,14,7]]}
[]
[null,"  Project Information"]
[]
[null,null,"Project Name"]
[null,null,"Project Location"]
[null,null,"Project Description"]
[null,null,"Contact Person"]
[]
[]
[null," Utility Information"]
{"$rows_left_out":16}
{"sheet":"Turbine Selection","index":2,"n_rows":34,"n_cols":9,"rows_kept":34,"cut":false,"hidden":false,"merged":[[31,4,34,6],[13,4,13,6],[14,4,14,6],[3,4,3,8],[4,4,4,8],[5,4,5,8],[6,4,6,8],[11,4,11,6]]}
[]
[null,"  Project Information"]
[]
[null,null,"Project Name",null,{"$f":"'Project Info'!E4","v":0}]
[null,null,"Project Location",null,{"$f":"'Project Info'!E5","v":0}]
[null,null,"Project Description",null,{"$f":"'Project Info'!E6","v":0}]
[null,null,"Contact Person",null,{"$f":"'Project Info'!E7","v":0}]
[]
[]
[null,"  Turbine Selection and Hydropower Potential"]
{"$rows_left_out":25}
{"sheet":"LCC Assumption","index":3,"n_rows":42,"n_cols":8,"rows_kept":42,"cut":false,"hidden":false,"merged":[[3,3,3,7],[4,3,4,7],[5,3,5,7],[6,3,6,7]]}
[]
[null,"  Project Information"]
[]
[null,null,"Project Name",{"$f":"'Project Info'!E4","v":0}]
[null,null,"Project Location",{"$f":"'Project Info'!E5","v":0}]
[null,null,"Project Description",{"$f":"'Project Info'!E6","v":0}]
[null,null,"Contact Person",{"$f":"'Project Info'!E7","v":0}]
[]
[]
[null,"  LCC Period, Cost, Financial and Economic Assumptions"]
{"$rows_left_out":33}
{"sheet":"Capital Costs","index":4,"n_rows":46,"n_cols":15,"rows_kept":46,"cut":false,"hidden":false,"merged":[[3,4,3,10],[4,4,4,10],[5,4,5,10],[6,4,6,10],[36,8,36,10],[24,8,24,10],[26,8,26,10],[29,8,29,10],[31,8,31,10],[34,8,34,10],[45,8,45,10],[16,8,16,10],[23,8,23,10],[8,1,8,11],[11,4,11,6],[17,8,17,10],[18,8,18,10],[19,8,19,10],[20,8,20,10],[21,8,21,10],[39,8,39,10],[22,8,22,10]]}
[]
[null,"  Project Information"]
[]
[null,null,null,"Project Name",{"$f":"'Project Info'!E4","v":0}]
[null,null,null,"Project Location",{"$f":"'Project Info'!E5","v":0}]
[null,null,null,"Project Description",{"$f":"'Project Info'!E6","v":0}]
[null,null,null,"Contact Person",{"$f":"'Project Info'!E7","v":0}]
[]
[]
[null,"  Input for Determination of Capital Costs of In-Conduit Hydropower Project"]
{"$rows_left_out":37}
{"sheet":"O&M Costs","index":5,"n_rows":18,"n_cols":9,"rows_kept":18,"cut":false,"hidden":false,"merged":[[11,4,11,6],[3,3,3,8],[4,3,4,8],[5,3,5,8],[6,3,6,8],[8,1,8,9]]}
[]
[null,"  Project Information"]
[]
[null,null,"Project Name",{"$f":"'Project Info'!E4","v":0}]
[null,null,"Project Location",{"$f":"'Project Info'!E5","v":0}]
[null,null,"Project Description",{"$f":"'Project Info'!E6","v":0}]
[null,null,"Contact Person",{"$f":"'Project Info'!E7","v":0}]
[]
[]
[null,"  O&M Costs of In-Conduit Hydropower Project"]
{"$rows_left_out":9}
{"sheet":"Benefits","index":6,"n_rows":41,"n_cols":11,"rows_kept":41,"cut":false,"hidden":false,"merged":[[3,5,3,9],[4,5,4,9],[5,5,5,9],[6,5,6,9]]}
[]
[null,"  Project Information"]
[]
[null,null,null,"Project Name",null,{"$f":"'Project Info'!E4","v":0}]
[null,null,null,"Project Location",null,{"$f":"'Project Info'!E5","v":0}]
[null,null,null,"Project Description",null,{"$f":"'Project Info'!E6","v":0}]
[null,null,null,"Contact Person",null,{"$f":"'Project Info'!E7","v":0}]
[]
[]
[null,"  Project Grants / Incentives"]
{"$rows_left_out":32}
{"sheet":"GHG Emissions","index":7,"n_rows":21,"n_cols":10,"rows_kept":21,"cut":false,"hidden":false,"merged":[[11,5,11,9],[3,3,3,9],[4,3,4,9],[5,3,5,9],[6,3,6,9]]}
[]
[null,"  Project Information"]
[]
[null,null,"Project Name",{"$f":"'Project Info'!E4","v":0}]
[null,null,"Project Location",{"$f":"'Project Info'!E5","v":0}]
[null,null,"Project Description",{"$f":"'Project Info'!E6","v":0}]
[null,null,"Contact Person",{"$f":"'Project Info'!E7","v":0}]
[]
[]
[null,"  GHG Emission Factor Selection"]
{"$rows_left_out":12}
{"sheet":"Output","index":8,"n_rows":78,"n_cols":15,"rows_kept":78,"cut":false,"hidden":false,"merged":[[30,5,30,7],[12,4,12,9],[19,4,19,9],[20,4,20,9],[13,4,13,9],[18,4,18,9],[21,4,21,9],[3,4,3,9],[4,4,4,9],[5,4,5,9],[6,4,6,9],[11,4,11,9]]}
[]
[null,"  Project Information"]
[]
[null,null,"Project Name",null,{"$f":"'Project Info'!E4","v":0}]
[null,null,"Project Location",null,{"$f":"'Project Info'!E5","v":0}]
[null,null,"Project Description",null,{"$f":"'Project Info'!E6","v":0}]
[null,null,"Contact Person",null,{"$f":"'Project Info'!E7","v":0}]
[]
[]
[null,"  Utility Information"]
{"$rows_left_out":69}
{"sheet":"Glossary","index":9,"n_rows":67,"n_cols":4,"rows_kept":67,"cut":false,"hidden":false,"merged":[]}
[]
[null,"  Glossary"]
[]
[null,null,"Term/Acronym","Definition"]
[null,null,"AKGD","Alaska Interconnection (ASCC) Alaska Grid"]
[null,null,"AKMS","Alaska Interconnection (ASCC) Miscellaneous"]
[null,null,"Annual energy generation","The annual energy produced from hydropower plant, calculated as follows:\n"]
[null,null,"Annual growth in electricity consumption","The expected increase in electricity rate to be purchased, expressed as a percentage"]
[null,null,"AZNM","Western Electricity Coordinating Council (WECC) Southwest"]
[null,null,"CAMX","Western Electricity Coordinating Council (WECC) California"]
{"$rows_left_out":58}
{"sheet":"Turbine calculation","index":10,"n_rows":25,"n_cols":23,"rows_kept":25,"cut":false,"hidden":true,"merged":[[9,4,9,6],[17,4,17,6],[19,4,19,6]]}
[null,null,null,null,null,null,null,null,null,null,null,null,null,null,null,"Pressure conversion"]
[null,"  Turbine Selection Calculation",null,null,null,null,null,null,null,null,null,null,null,null,null,"bar","ft",null,"psi ","ft"]
[null,null,null,null,null,null,null,null,null,null,null,null,null,null,null,1,33.456200000000003,null,1,{"$f":"1/0.43","v":2.3255813953488373}]
[null,null,null,null,"Unit",null,"Value",null,"For calculation"]
[null,null,"Upstream Pressure ",null,{"$f":"IF('Turbine Selection'!E18=\"psi\", \"psi\", IF('Turbine Selection'!E18=\"ft\", \"ft\", IF('Turbine Selection'!E18=\"bar\", \"bar\", \"ft\")))","v":"ft"},null,{"$f":"'Turbine Selection'!G18","v":0},null,{"$f":"IF(E5=\"ft\", G5, IF(E5=\"psi\", G5*$T$3, IF(E5=\"bar\", G5*$Q$3, FALSE)))","v":0},"ft",null,null,null,null,null,"Flow conversion"]
[null,null,"Downstream Pressure",null,{"$f":"IF('Turbine Selection'!E19=\"psi\", \"psi\", IF('Turbine Selection'!E19=\"ft\", \"ft\", IF('Turbine Selection'!E19=\"bar\", \"bar\", \"ft\")))","v":"ft"},null,{"$f":"'Turbine Selection'!G19","v":0},null,{"$f":"IF(E6=\"ft\", G6, IF(E6=\"psi\", G6*$T$3, IF(E6=\"bar\", G6*$Q$3, FALSE)))","v":0},"ft",null,null,null,null,null,"mgd","cfs",null,"gpm","cfs",null,"lps","cfs"]
[null,null,null,null,null,null,null,null,null,null,null,null,null,null,null,1,1.5472286365101,null,1,2.2280023234587001E-3,null,1,3.5314666721489002E-2]
[null,null,"Calculated Differential Pressure",null,{"$f":"E6","v":"ft"},null,{"$f":"'Turbine Selection'!G21","v":0},null,{"$f":"IF(E8=\"ft\", G8, IF(E8=\"psi\", G8*$T$3, IF(E8=\"bar\", G8*$Q$3, FALSE)))","v":0},"ft"]
[]
[null,null,"Downstream Pressure Requirement",null,{"$f":"'Turbine Selection'!E12","v":"- Select"}]
{"$rows_left_out":16}
{"sheet":"Cost Reference","index":11,"n_rows":91,"n_cols":25,"rows_kept":91,"cut":false,"hidden":true,"merged":[[42,1,42,8],[43,0,44,0],[43,1,43,2],[43,3,43,4],[43,5,43,6],[43,7,43,8],[28,1,28,8],[29,0,30,0],[29,1,29,2],[29,3,29,4],[29,5,29,6],[29,7,29,8],[18,10,18,11],[0,13,0,14],[0,1,0,8],[1,0,2,0],[1,1,1,2],[1,3,1,4],[1,5,1,6],[1,7,1,8],[14,1,14,8],[15,0,16,0],[15,1,15,2],[15,3,15,4],[15,5,15,6],[15,7,15,8],[0,16,0,17],[0,19,0,20],[0,10,0,11],[6,10,6,11],[12,10,12,11]]}
[null," <100 kW (mid point)",null,null,null,null,null,null,null,null,"Francis",null,null,"PAT",null,null,"Pelton",null,null,"Turgo"]
["Cost Item","Francis",null,"PAT",null,"Pelton",null,"Turgo",null,null,"size (kW)","Turbine Cost ($)",null,"size (kW)","Turbine Cost ($)",null,"size (kW)","Turbine Cost ($)",null,"size (kW)","Turbine Cost ($)"]
[null,"Factor","Cost","Factor","Cost","Factor","Cost","Factor","Cost",null,250,{"$f":"C18","v":750000},null,50,{"$f":"E4","v":100000},null,250,{"$f":"G18","v":650000},null,50,{"$f":"I4","v":500000}]
["Turbine/Generator/Switch Gear","-","Turbine type is not feasible for specified capacity",null,100000,"Factor","Not suitable",null,500000,null,750,{"$f":"C32","v":1100000},null,250,{"$f":"E18","v":350000},null,750,{"$f":"G32","v":950000},null,250,{"$f":"I18","v":600000}]
["Programming","-","Turbine type is not feasible for specified capacity",0.3,{"$f":"D5*E4","v":30000},null,"Not suitable",0.05,{"$f":"H5*I4","v":25000},null,2500,{"$f":"C46","v":1800000},null,null,null,null,2500,{"$f":"G46","v":1500000},null,750,{"$f":"I32","v":800000}]
["Civil ","-","Turbine type is not feasible for specified capacity",1.5,{"$f":"D6*E4","v":150000},null,"Not suitable",0.1,{"$f":"H6*I4","v":50000},null,null,null,null,null,null,null,null,null,null,2500,{"$f":"I46","v":1200000}]
["Mechanical","-","Turbine type is not feasible for specified capacity",0.3,{"$f":"D7*E4","v":30000},null,"Not suitable",0.3,{"$f":"H7*I4","v":150000}]
["Electrical Assembly & Wiring","-","Turbine type is not feasible for specified capacity",0.3,{"$f":"D8*E4","v":30000},null,"Not suitable",0.3,{"$f":"H8*I4","v":150000}]
["Buildings & Structures","-","Turbine type is not feasible for specified capacity",1,{"$f":"D9*E4","v":100000},null,"Not suitable",0.3,{"$f":"H9*I4","v":150000}]
["Interconnection","-","Turbine type is not feasible for specified capacity",0.1,{"$f":"D10*SUM(E4:E9)","v":44000},null,"Not suitable",0.05,{"$f":"H10*SUM(I4:I9)","v":51250}]
{"$rows_left_out":82}
{"sheet":"Dropdown","index":12,"n_rows":50,"n_cols":9,"rows_kept":50,"cut":false,"hidden":true,"merged":[]}
[null,null,"Conduit Type","Facility Type","Topography","Water type","Downstream Pressure Requirement","Financing","Turbine Type"]
[null,null,"- Select","- Select","- Select","- Select","- Select","Select-","- Select"]
[null,null,"Canal ","Canal Drop","Coastal","Raw Water","Required","LS","Francis"]
[null,null,"Dam","Flow Control Facility","Mountain","Potable Water","Not required","D/S","Pump-as-Turbine"]
[null,null,"Pipeline","Existing Hydroelectric Facility","Urban","Wastewater",null,null,"Turgo"]
[null,null,"Groundwater Recharge","Groundwater Recharge","Other","Reclaimed/Recycled Water",null,null,"Pelton"]
[null,null,"Other","Pressure Reducing Valve"]
[null,null,null,"Reservoir Outlet"]
[null,null,null,"Water Treatment Plant"]
[null,null,null,"Wastewater Treatment Plant"]
{"$rows_left_out":41}
{"sheet":"LCC Assumption - Hidden","index":13,"n_rows":87,"n_cols":7,"rows_kept":87,"cut":false,"hidden":true,"merged":[]}
["Life Cycle Cost Model"]
[{"$f":"ProjName","v":{"$error":"#REF!"}}]
["LCC Period, Cost, Financial and Economic Assumptions"]
[]
["Topic",null,null,null,"Value","Units","Notes"]
["Life Cycle Assumptions"]
[null,"Period",null,null,{"$f":"'LCC Assumption'!F13","v":0},"years"]
[null,"Initial Year of Operations",null,null,{"$f":"'LCC Assumption'!F14","v":0},null,"First year of operations following initial construction"]
[null,"Year of analysis",null,null,{"$f":"'LCC Assumption'!F15","v":0},null,"\"Present\" year for present value or present worth computations"]
[]
{"$rows_left_out":78}
{"sheet":"Energy, Labor Hidden","index":14,"n_rows":17,"n_cols":98,"rows_kept":17,"cut":false,"hidden":true,"merged":[]}
["Life Cycle Cost Model"]
[{"$f":"ProjName","v":{"$error":"#REF!"}}]
["Energy, Chemical and Labor Costs"]
[]
[null,null,2012,{"$f":"C5+1","v":2013},{"$f":"D5+1","v":2014},2015,2016,2017,2018,2019,2020,2021,2022,2023,2024,2025,2026,2027,2028,2029,2030,2031,{"$f":"V5+1","v":2032},2033,2034,2035,2036,2037,2038,2039,2040,2041,2042,{"$f":"AG5+1","v":2043},{"$f":"AH5+1","v":2044},{"$f":"AI5+1","v":2045},{"$f":"AJ5+1","v":2046},{"$f":"AK5+1","v":2047},2048,2049,2050,2051,2052,2053,2054,2055,2056,2057,2058,2059,2060,2061,2062,2063,2064,2065,{"$f":"BD5+1","v":2066},{"$f":"BE5+1","v":2067},{"$f":"BF5+1","v":2068},{"$f":"BG5+1","v":2069},{"$f":"BH5+1","v":2070},{"$f":"BI5+1","v":2071},{"$f":"BJ5+1","v":2072},{"$f":"BK5+1","v":2073},{"$f":"BL5+1","v":2074},{"$f":"BM5+1","v":2075},{"$f":"BN5+1","v":2076},{"$f":"BO5+1","v":2077},{"$f":"BP5+1","v":2078},{"$f":"BQ5+1","v":2079},{"$f":"BR5+1","v":2080},{"$f":"BS5+1","v":2081},{"$f":"BT5+1","v":2082},{"$f":"BU5+1","v":2083},{"$f":"BV5+1","v":2084},{"$f":"BW5+1","v":2085},{"$f":"BX5+1","v":2086},{"$f":"BY5+1","v":2087},{"$f":"BZ5+1","v":2088},{"$f":"CA5+1","v":2089},{"$f":"CB5+1","v":2090},{"$f":"CC5+1","v":2091},{"$f":"CD5+1","v":2092},{"$f":"CE5+1","v":2093},{"$f":"CF5+1","v":2094},{"$f":"CG5+1","v":2095},{"$f":"CH5+1","v":2096},{"$f":"CI5+1","v":2097},{"$f":"CJ5+1","v":2098},{"$f":"CK5+1","v":2099},{"$f":"CL5+1","v":2100},null,null,null,null,null,null,"(row)"]
[null,null,null,null,null,null,null,null,null,null,null,null,null,null,null,null,null,null,null,null,null,null,null,null,null,null,null,null,null,null,null,null,null,null,null,null,null,null,null,null,null,null,null,null,null,null,null,null,null,null,null,null,null,null,null,null,null,null,null,null,null,null,null,null,null,null,null,null,null,null,null,null,null,null,null,null,null,null,null,null,null,null,null,null,null,null,null,null,null,null,null,null,null,null,null,null,null,2]
["Energy",null,null,null,null,null,null,null,null,null,null,null,null,null,null,null,null,null,null,null,null,null,null,null,null,null,null,null,null,null,null,null,null,null,null,null,null,null,null,null,null,null,null,null,null,null,null,null,null,null,null,null,null,null,null,null,null,null,null,null,null,null,null,null,null,null,null,null,null,null,null,null,null,null,null,null,null,null,null,null,null,null,null,null,null,null,null,null,null,null,null,null,null,null,null,null,null,{"$f":"CT6+1","v":3}]
[null,null,null,null,null,null,null,null,null,null,null,null,null,null,null,null,null,null,null,null,null,null,null,null,null,null,null,null,null,null,null,null,null,null,null,null,null,null,null,null,null,null,null,null,null,null,null,null,null,null,null,null,null,null,null,null,null,null,null,null,null,null,null,null,null,null,null,null,null,null,null,null,null,null,null,null,null,null,null,null,null,null,null,null,null,null,null,null,null,null,null,null,null,null,null,null,null,{"$f":"CT7+1","v":4}]
[" Natural Gas Purveyor",null,null,null,null,null,null,null,null,null,null,null,null,null,null,null,null,null,null,null,null,null,null,null,null,null,null,null,null,null,null,null,null,null,null,null,null,null,null,null,null,null,null,null,null,null,null,null,null,null,null,null,null,null,null,null,null,null,null,null,null,null,null,null,null,null,null,null,null,null,null,null,null,null,null,null,null,null,null,null,null,null,null,null,null,null,null,null,null,null,null,null,null,null,null,null,null,5]
[null,"$/MMBTU",{"$f":"'LCC Assumption'!F38","v":0},{"$f":"C10*(1+D11)","v":0},0,{"$f":"E10*(1+F11)","v":0},0,0,0,0,0,0,0,0,0,0,0,0,0,0,0,0,0,0,0,0,0,0,0,0,0,0,0,{"$f":"AG10*(1+AH11)","v":0},{"$f":"AH10*(1+AI11)","v":0},{"$f":"AI10*(1+AJ11)","v":0},{"$f":"AJ10*(1+AK11)","v":0},{"$f":"AK10*(1+AL11)","v":0},0,0,0,0,0,0,0,0,0,0,0,0,0,0,0,0,0,0,0,0,0,0,0,0,0,0,0,0,0,0,0,0,0,0,0,0,0,0,0,0,0,0,0,0,0,0,0,0,0,0,0,0,0,null,null,null,null,null,null,{"$f":"#REF!+1","v":{"$error":"#REF!"}}]
{"$rows_left_out":8}
{"sheet":"LCC Capital ","index":15,"n_rows":119,"n_cols":58,"rows_kept":119,"cut":false,"hidden":true,"merged":[[60,0,60,10]]}
["Life Cycle Cost Model"]
[{"$f":"ProjName","v":{"$error":"#REF!"}}]
["LCC Capital Costs and Schedule,",null,null,null,"LNG Power for the Entire Plant"]
["($000s)"]
[null,null,null,null,null,null,null,null,{"$f":"FirstOps","v":0},{"$f":"I5+1","v":1},{"$f":"J5+1","v":2},{"$f":"K5+1","v":3},4,5,6,7,8,9,10,11,12,13,14,15,16,17,18,19,20,21,22,23,24,25,26,27,28,29,30,31,32,33,34,35,36,37,38,39,40,41,42,43,44,45,46,47,48,49]
[null,null,null,null,null,null,null,null," "," "," "," "," "," "," "," "," "," "," "," "," "," "," "," "," "," "," "," "," "," "," "," "," "," "," "," "," "," "," "," "," "," "," "," "," "," "," "," "," "," "," "," "," "," "," "," "," "," "]
[null,null,null,null,null,null,null,null,1,{"$f":"I7+1","v":2},{"$f":"J7+1","v":3},{"$f":"K7+1","v":4},5,6,7,8,9,10,11,12,13,14,15,16,17,18,19,20,21,22,23,24,25,26,27,28,29,30,31,32,33,34,35,36,37,38,39,40,41,42,43,44,45,46,47,48,49,50]
["Present Values of Capital Components",null,null,null,null,"Totals"]
[null,null,null,null,{"$f":"PresentYear","v":0},{"$f":"SUM(I9:BF9)-H44","v":{"$error":"#VALUE!"}},null,null,{"$f":"IF(CapitalTrtmt=\"d/s\",I$69/(1+DiscRat)^(I$5-PresentYear),I$19/(1+DiscRat)^(I$5-PresentYear))","v":{"$error":"#VALUE!"}},{"$f":"IF(CapitalTrtmt=\"d/s\",J$69/(1+DiscRat)^(J$5-PresentYear),J$19/(1+DiscRat)^(J$5-PresentYear))","v":0},0,0,0,0,0,0,0,0,0,0,0,0,0,0,0,0,0,0,0,0,0,0,0,0,0,0,0,0,0,0,{"$f":"IF(CapitalTrtmt=\"d/s\",AO$69/(1+DiscRat)^(AO$5-PresentYear),AO$19/(1+DiscRat)^(AO$5-PresentYear))","v":0},0,0,0,0,0,0,0,0,0,0,0,0,0,0,0,0,0]
[]
{"$rows_left_out":110}
{"sheet":"LCC O&M","index":16,"n_rows":73,"n_cols":55,"rows_kept":73,"cut":false,"hidden":true,"merged":[]}
["Life Cycle Cost Model"]
[{"$f":"ProjName","v":{"$error":"#REF!"}}]
["LCC O&M Costs and Intangibles, ",null,null,null,"LNG for the Entire Plant"]
["($0s)"]
[null,null,null,null,null,{"$f":"'LCC Capital '!I5","v":0},{"$f":"F5+1","v":1},{"$f":"G5+1","v":2},3,4,5,6,7,8,9,10,11,12,13,14,15,16,17,18,19,20,21,22,23,24,25,26,27,28,29,30,31,32,33,34,35,36,37,38,39,40,41,42,43,44,45,46,47,48,49]
[null,null,null,null,null," "," "," "," "," "," "," "," "," "," "," "," "," "," "," "," "," "," "," "," "," "," "," "," "," "," "," "," "," "," "," "," "," "," "," "," "," "," "," "," "," "," "," "," "," "," "," "," "," "," "]
[null,null,null,null,null,1,{"$f":"F7+1","v":2},{"$f":"G7+1","v":3},4,5,6,7,8,9,10,11,12,13,14,15,16,17,18,19,20,21,22,23,24,25,26,27,28,29,30,31,32,33,34,35,36,37,38,39,40,41,42,43,44,45,46,47,48,49,50]
["PV of O&M and Intang. Costs"]
[null,"Total",null,null,{"$f":"PresentYear","v":0},{"$f":"SUM(F10:BC10)","v":{"$error":"#N/A"}}]
[null,"Annual",null,null,{"$f":"PresentYear","v":0},{"$f":"F$20/(1+DiscRat)^(F$5-PresentYear)","v":{"$error":"#N/A"}},{"$f":"IF(G$7<=LCCPeriod,(G$20/(1+DiscRat)^(G$5-PresentYear)),0)","v":0},0,0,0,0,0,0,0,0,0,0,0,0,0,0,0,0,0,0,0,0,0,0,0,0,0,0,0,0,0,0,0,{"$f":"IF(AM$7<=LCCPeriod,(AM$20/(1+DiscRat)^(AM$5-PresentYear)),0)","v":0},0,0,0,0,0,0,0,0,0,0,0,0,0,0,0,0]
{"$rows_left_out":64}
{"sheet":"Payback Period","index":17,"n_rows":76,"n_cols":27,"rows_kept":76,"cut":false,"hidden":true,"merged":[[22,3,22,16]]}
[]
[]
[null,null,null,"Base Year",{"$f":"'LCC Assumption'!F18","v":0}]
[null,null,null,"Year 1 Capital Cost",{"$f":"'Capital Costs'!G46","v":0},null,null,null,null,null,null,null,null,null,"Economic performance parameters:"]
[null,null,null,"Year 1 Operation Cost",{"$f":"'O&M Costs'!G18","v":0},null,null,null,null,null,null,null,null,null,20,"period (years)"]
[null,null,null,"Subsidy",{"$f":"Benefits!I18","v":0},null,null,null,null,null,null,null,null,null,{"$f":"-SUM(P25:P44)/SUM(P24)","v":{"$error":"#DIV/0!"}},"benefit cost ratio"]
[null,null,null,"Escalation Rate - Construction","NA","(Construction costs NOT escalated)",null,null,null,null,null,null,null,null,{"$f":"IRR(N24:N44,0.04)","v":{"$error":"#NUM!"}},"IRR"]
[null,null,null,"Escalation Rate - O&M",{"$f":"'LCC Assumption'!F20","v":0},null,null,null,null,null,null,null,null,null,{"$f":"Q44","v":0},"NPV"]
[null,null,null,"Escalation Rate - Energy",{"$f":"'LCC Assumption'!F20","v":0},null,null,null,null,null,null,null,null,null,{"$f":"INDEX(R25:R74,COUNTIF(Q25:Q74,\"<0\")+1)+COUNTIF(Q25:Q74,\"<0\")","v":{"$error":"#DIV/0!"}},"payback period"]
[null,null,null,"Discount Rate",{"$f":"'LCC Assumption'!F32","v":0},null,null,null,null,null,null,null,null,null,"based on 50 yrs operation"]
{"$rows_left_out":67}
{"sheet":"PB - dont use","index":18,"n_rows":59,"n_cols":17,"rows_kept":59,"cut":false,"hidden":true,"merged":[[0,7,0,12],[0,15,0,16],[3,2,3,4],[3,7,3,12],[3,15,3,16]]}
[null,null,null,null,null,null,null,"Net Energy Benefit to District",null,null,null,null,null,null,null,"Economic Beneft"]
[null,null,null,null,null,null,null,"Estimated System Size (kW) =",null,null,null,null,197]
[]
[null,null,"Cost",null,null,null,null,"Benefits",null,null,null,null,null,null,null,"Savings"]
[null,null,"Time (year)","Project Cost","Subsidy",null,null,"Avoided Cost","Bill Credits (RES-BCT)","Net Surplus Generation","Revenue from REC Sales","Less O&M Cost","Net Benefit - OM Cost",null,null,"Cash Flow","Net Invested Cash"]
[null,null,0,{"$f":"'Capital Costs'!G46","v":0},null,null,null,null,null,null,null,null,null,null,null,{"$f":"-D6","v":0},{"$f":"P6","v":0}]
[null,null,1,null,{"$f":"Benefits!I18","v":0},null,null,{"$f":"Benefits!I32","v":0},null,{"$f":"Benefits!I41*(1+'LCC Assumption'!$F$20)^(C7-$C$6)","v":0},{"$f":"Benefits!I34","v":0},{"$f":"'O&M Costs'!$G$18*(1+'LCC Assumption'!$F$20)^(C7-$C$6)","v":0},{"$f":"H7+J7+K7-L7","v":0},null,null,{"$f":"M7+E7","v":0},{"$f":"Q6+P7","v":0}]
[null,null,2,null,null,null,null,{"$f":"$H$7*(1+'LCC Assumption'!$F$20)^(C8-$C$7)","v":0},null,{"$f":"$J$7*(1+'LCC Assumption'!$F$20)^(C8-$C$7)","v":0},{"$f":"$K$7*(1+'LCC Assumption'!$F$20)^(C8-$C$7)","v":0},{"$f":"'O&M Costs'!$G$18*(1+'LCC Assumption'!$F$20)^(C8-$C$6)","v":0},0,null,null,0,{"$f":"Q7+P8","v":0}]
[null,null,3,null,null,null,null,{"$f":"$H$7*(1+'LCC Assumption'!$F$20)^(C9-$C$7)","v":0},null,{"$f":"$J$7*(1+'LCC Assumption'!$F$20)^(C9-$C$7)","v":0},{"$f":"$K$7*(1+'LCC Assumption'!$F$20)^(C9-$C$7)","v":0},{"$f":"'O&M Costs'!$G$18*(1+'LCC Assumption'!$F$20)^(C9-$C$6)","v":0},0,null,null,0,0]
[null,null,4,null,null,null,null,{"$f":"$H$7*(1+'LCC Assumption'!$F$20)^(C10-$C$7)","v":0},null,{"$f":"$J$7*(1+'LCC Assumption'!$F$20)^(C10-$C$7)","v":0},{"$f":"$K$7*(1+'LCC Assumption'!$F$20)^(C10-$C$7)","v":0},{"$f":"'O&M Costs'!$G$18*(1+'LCC Assumption'!$F$20)^(C10-$C$6)","v":0},0,null,null,0,0]
{"$rows_left_out":49}