{"text_format":"1","workbook":"xlsx","n_sheets":10,"sheets":["Instructions","Invoice Payment Cover Sheet","Invoice Summary","DL & FB","Travel","Equipment","Materials & Miscellaneous","Subs & Vendors","Indirect Costs & Profit","Lists"],"not_rendered":{"charts":0,"images":0,"macros":0,"external_links":0,"defined_names":19,"comments":0,"pivot_tables":0},"unopened":[],"bounds":{"document_bytes":16777216,"sheet_cells":100000,"rows_first":2000,"rows_last":500,"rows_between":2000,"halvings":0,"cell_chars":16384,"cell_head_chars":4096},"cells_cut":0,"cells_raw":0,"read":"whole","date_system":"1900"}

{"sheet":"Instructions","index":0,"n_rows":20,"n_cols":6,"rows_kept":20,"cut":false,"hidden":false,"merged":[]}
["Workbook Instructions",null,null,null,null,"SANDBOX AREA (highlighted in light red)- For rough work associated with the print area to the left.  Rough work may include, notes, calculations, derivations, etc."]
["Enter information as required in all cells highlighted in Blue."]
["All cells not highlighted in Blue are locked from editing.  Locked cells include:  cells with formulas highlighted in Gray or Light Yellow, cells with no color fill (white), etc."]
["Rules for decimal places on values:"]
["·         Budget and Invoice values:"]
["o   Rounding of any values, as described below, should be performed using standard rounding practices."]
["o   For all currency rates (e.g., Direct Labor, and Unit Cost):  Round to the cent ($0.01)."]
["o   For all percentage rates (e.g., Fringe Benefits, Indirect Cost, and Profit):  Round to a maximum of two decimal places of a percent (e.g., 25.12%).  You can round to less if desired, such as one decimal place (e.g., 25.1%), or zero decimal places (e.g., 25%)."]
["o   For all quantity values (e.g., # of hours, # of months, and # of units):  Round to a maximum of two decimal places (e.g., 50.12).  You can round to less if desired, such as one decimal place (e.g., 50.1), or zero decimal places (e.g., 50)."]
["·         Budget values:"]
{"$rows_left_out":11}
{"sheet":"Invoice Payment Cover Sheet","index":1,"n_rows":45,"n_cols":9,"rows_kept":45,"cut":false,"hidden":false,"merged":[[43,0,43,1],[27,0,27,3],[42,2,42,3],[35,0,35,3],[44,2,44,3],[43,2,43,3],[44,0,44,1],[42,0,42,1]]}
["Invoice Payment Request",null,null,null,null,null,null,null,"SANDBOX AREA (highlighted in light red)- For rough work associated with the print area to the left.  Rough work may include, notes, calculations, derivations, etc."]
[]
["Insert Company Logo"]
[]
["Physical Address:",null,"Bill To:"]
["Company Name",null,"California Energy Commission"]
["Company Address 1",null,"Accounting Office, MS-2"]
["Company Address 2",null,"1516 Ninth Street"]
["City, State, Zip",null,"Sacramento, CA 95814"]
[]
{"$rows_left_out":36}
{"sheet":"Invoice Summary","index":2,"n_rows":41,"n_cols":11,"rows_kept":41,"cut":false,"hidden":false,"merged":[[41,0,41,5],[10,0,10,5],[22,0,22,5],[36,0,36,1],[40,0,40,1],[37,0,37,1],[38,0,38,1],[37,3,37,4],[36,3,36,4],[38,3,38,4],[39,3,39,5],[8,1,8,5],[40,3,40,4],[3,2,3,5],[5,2,5,5],[7,2,7,5],[7,0,7,1],[0,0,0,5],[2,0,2,1],[2,2,2,5],[3,0,3,1],[6,2,6,5],[5,0,5,1],[4,0,4,1],[4,2,4,5],[6,0,6,1]]}
["Energy Commission Grant Invoice\nSummary by Category Budget",null,null,null,null,null,null,null,null,null,"SANDBOX AREA (highlighted in light red)- For rough work associated with the print area to the left.  Rough work may include, notes, calculations, derivations, etc."]
[]
["Company Name:",null,{"$f":"'Invoice Payment Cover Sheet'!A6","v":"Company Name"}]
["Agreement Number:",null,{"$f":"'Invoice Payment Cover Sheet'!D11","v":"xxx-xx-xxx"}]
["Invoice Date:",null,{"$f":"'Invoice Payment Cover Sheet'!D12","v":"mm/dd/yyyy"}]
["Invoice Number:",null,{"$f":"'Invoice Payment Cover Sheet'!D13","v":"ABC-YY-###-##"}]
["Company Tracking Number (optional):",null,{"$f":"IF('Invoice Payment Cover Sheet'!D14=\"\",\"\",'Invoice Payment Cover Sheet'!D14)","v":"##########"}]
["Period Covered by this Request:",null,{"$f":"'Invoice Payment Cover Sheet'!D15","v":"mm/dd/yyyy - mm/dd/yyyy"}]
["Retention Method:","Select a Retention Method"]
[]
{"$rows_left_out":32}
{"sheet":"DL & FB","index":3,"n_rows":217,"n_cols":18,"rows_kept":217,"cut":false,"hidden":false,"merged":[[216,0,216,12],[0,0,0,12],[1,0,1,12],[2,0,2,12],[106,0,106,12],[104,0,104,4],[208,0,208,4],[213,0,213,4],[210,0,210,12],[215,0,215,12],[211,5,211,6],[211,7,211,12],[211,0,212,4]]}
["TRAINING INVOICE",null,null,null,null,null,null,null,null,null,null,null,null,null,null,null,null,"SANDBOX AREA (highlighted in light red)- For rough work associated with the print area to the left.  Rough work may include, notes, calculations, derivations, etc."]
["DIRECT LABOR (DL) AND FRINGE BENEFITS (FB)"]
[" Hourly (Unloaded)"]
["Employee Name","Job Classification","DIRECT LABOR:\n\nActual\nDirect Labor Rate\nBilled/Match\n($ per hour)","FRINGE BENEFITS:\n\nActual\nFringe Benefit Rate\nBilled/Match (%)","DIRECT LABOR:\n\nActual\n# of Hours Billed/Match This Period","DIRECT LABOR:\n\nActual\nDL Rate x Hours \n(also FB Base amount)","FRINGE BENEFITS:\n\nActual\nFB Rate x Base amount","DIRECT LABOR:\n\nActual\nCEC Reimbursable DL Expenses","DIRECT LABOR:\n\nActual Match \nShare DL\nExpenses","FRINGE BENEFITS:\n\nActual\nCEC Reimbursable FB Expenses","FRINGE BENEFITS:\n\nActual\nMatch Share FB Expenses","DIRECT LABOR:\n\nDL Total","FRINGE BENEFITS:\n\nFB Total"]
["First Name Last Name1","Project Manager1",43.86,0.51200000000000001,10,{"$f":"ROUND($C5*$E5,2)","v":438.6},{"$f":"ROUND(D5*F5,2)","v":224.56},{"$f":"438.6+0.004999999","v":438.60499999900003},0,{"$f":"224.56+0.0049","v":224.56489999999999},0,{"$f":"SUM(ROUND(H5:I5,2))","v":438.6},{"$f":"SUM(ROUND(J5:K5,2))","v":224.56}]
["First Name Last Name2","Project Manager2",68.91,0.624,10,{"$f":"ROUND($C6*$E6,2)","v":689.1},{"$f":"ROUND(D6*F6,2)","v":430},689.1,0,{"$f":"430+0","v":430},0,{"$f":"SUM(ROUND(H6:I6,2))","v":689.1},{"$f":"SUM(ROUND(J6:K6,2))","v":430}]
["First Name Last Name3","Project Manager3",85.26,0.73299999999999998,10,852.6,624.96,852.6,0,{"$f":"624.96+0","v":624.96},0,{"$f":"SUM(ROUND(H7:I7,2))","v":852.6},{"$f":"SUM(ROUND(J7:K7,2))","v":624.96}]
["First Name Last Name4","Engineer1",28.53,0.46600000000000003,20,570.6,265.89999999999998,570.6,0,{"$f":"265.9+0","v":265.89999999999998},0,{"$f":"SUM(ROUND(H8:I8,2))","v":570.6},{"$f":"SUM(ROUND(J8:K8,2))","v":265.89999999999998}]
["First Name Last Name5","Engineer2",41.25,0.49299999999999999,20,825,406.73,825,0,{"$f":"406.73+0","v":406.73},0,{"$f":"SUM(ROUND(H9:I9,2))","v":825},{"$f":"SUM(ROUND(J9:K9,2))","v":406.73}]
["First Name Last Name6","Engineer3",79.849999999999994,0.53700000000000003,20,1597,{"$f":"ROUND(D10*F10,2)","v":857.59},1597,0,{"$f":"857.59+0.01","v":857.6},0,{"$f":"SUM(ROUND(H10:I10,2))","v":1597},{"$f":"SUM(ROUND(J10:K10,2))","v":857.6}]
{"$rows_left_out":208}
{"sheet":"Travel","index":4,"n_rows":54,"n_cols":14,"rows_kept":54,"cut":false,"hidden":false,"merged":[[1,0,1,8],[0,0,0,8],[53,0,53,5]]}
["TRAINING INVOICE",null,null,null,null,null,null,null,null,null,null,null,null,"SANDBOX AREA (highlighted in light red)- For rough work associated with the print area to the left.  Rough work may include, notes, calculations, derivations, etc."]
["TRAVEL"]
["Budget Worksheet Reference ID","Task #","Traveler Name and Job  Classification","Dates of Travel (From/To)","Departure and Destination","Trip Purpose","Billed\nCEC\nExpenses","Match \nShare\nExpenses","Total"]
["T-1",1,"First Name Last Name, job classification","3/20/20 - 3/23/20","Sacramento to LA","Sacramento to LA; CPR#1 and Site Visit #1",78.63,21.56,{"$f":"SUM(ROUND(G4:H4,2))","v":100.19}]
[null,null,null,null,null,null,0,0,{"$f":"SUM(ROUND(G5:H5,2))","v":0}]
[null,null,null,null,null,null,0,0,{"$f":"SUM(ROUND(G6:H6,2))","v":0}]
[null,null,null,null,null,null,0,0,{"$f":"SUM(ROUND(G7:H7,2))","v":0}]
[null,null,null,null,null,null,0,0,{"$f":"SUM(ROUND(G8:H8,2))","v":0}]
[null,null,null,null,null,null,0,0,{"$f":"SUM(ROUND(G9:H9,2))","v":0}]
[null,null,null,null,null,null,0,0,{"$f":"SUM(ROUND(G10:H10,2))","v":0}]
{"$rows_left_out":45}
{"sheet":"Equipment","index":5,"n_rows":211,"n_cols":18,"rows_kept":211,"cut":false,"hidden":false,"merged":[[206,11,206,12],[2,2,3,2],[2,4,3,4],[1,0,1,12],[0,0,0,12],[209,0,209,12],[210,0,210,12],[2,11,2,12],[2,0,3,0],[2,1,3,1],[2,3,3,3],[2,5,3,5],[2,6,3,6],[2,7,3,7],[2,8,3,8],[2,9,3,9],[2,10,3,10],[206,0,206,6],[208,0,208,12]]}
["TRAINING INVOICE",null,null,null,null,null,null,null,null,null,null,null,null,null,null,null,null,"SANDBOX AREA (highlighted in light red)- For rough work associated with the print area to the left.  Rough work may include, notes, calculations, derivations, etc."]
["EQUIPMENT"]
["Budget Worksheet Reference ID","Task #","Legal Name of entity providing equipment: Recipient/ Subrecipient/ Vendor","Description","Purpose","# of Units\nBilled/Match","Unit Cost\nBilled/Match \nThis Period ($)","Total:  \n# of Units x Unit Cost","Billed\nCEC\nExpenses","Match \nShare\nExpenses","Total","Use If Requesting Payment for Incurred Costs or Reimbursement for Partial Payments"]
[null,null,null,null,null,null,null,null,null,null,null,"Check Box if Expense is a Partial Payment","Provide payment amount(s) and CEC invoice number(s) for prior payment(s)"]
["E-1",4,"M&M Inc.","Equipment Type A","Needed to help complete project",5,27697.45,{"$f":"ROUND(F5*G5,2)","v":138487.25},{"$f":"H5-100000-25000","v":13487.25},25000,{"$f":"SUM(ROUND(I5:J5,2))","v":38487.25},null,"$100,000 on invoice 9"]
["E-2",2,"Equipment Inc.","Equipment Type B","Needed to help complete project",11,48239.11,{"$f":"ROUND(F6*G6,2)","v":530630.21},{"$f":"530630.21-21563.57","v":509066.63999999996},21563.57,{"$f":"SUM(ROUND(I6:J6,2))","v":530630.21}]
["E-3",2,"Equipment Inc.","Equipment Type C","Needed to help complete project",3,4963,14889,7000,{"$f":"H7-7000","v":7889},{"$f":"SUM(ROUND(I7:J7,2))","v":14889}]
[null,null,null,null,null,0,0,0,0,0,{"$f":"SUM(ROUND(I8:J8,2))","v":0}]
[null,null,null,null,null,0,0,0,0,0,{"$f":"SUM(ROUND(I9:J9,2))","v":0}]
[null,null,null,null,null,0,0,0,0,0,{"$f":"SUM(ROUND(I10:J10,2))","v":0}]
{"$rows_left_out":202}
{"sheet":"Materials & Miscellaneous","index":6,"n_rows":210,"n_cols":18,"rows_kept":210,"cut":false,"hidden":false,"merged":[[208,0,208,12],[2,7,3,7],[206,0,206,6],[0,0,0,12],[1,0,1,12],[209,0,209,12],[2,11,2,12],[2,10,3,10],[2,9,3,9],[2,8,3,8],[2,4,3,4],[2,3,3,3],[2,1,3,1],[2,0,3,0],[2,2,3,2],[2,5,3,5],[2,6,3,6]]}
["TRAINING INVOICE",null,null,null,null,null,null,null,null,null,null,null,null,null,null,null,null,"SANDBOX AREA (highlighted in light red)- For rough work associated with the print area to the left.  Rough work may include, notes, calculations, derivations, etc."]
["MATERIALS & MISCELLANEOUS"]
["Budget Worksheet Reference ID","Task #","Legal Name of entity providing the item(s): Recipient/ Subrecipient/ Vendor","Description","Purpose","# of Units\nBilled/ Match","Unit Cost\nBilled/Match \nThis Period ($)","Total:  \n# of Units x Unit Cost","Billed\nCEC Expenses","Match \nShare\nExpenses","Total","Use If Requesting Payment for Incurred Costs or Reimbursement for Partial Payments"]
[null,null,null,null,null,null,null,null,null,null,null,"Check Box if Expense is a Partial Payment","Provide payment amount(s) and CEC invoice number(s) for prior payment(s)"]
["M-1",1,"Materials LLC","Material Type Z","to build item for project",50,149.53,{"$f":"ROUND(F5*G5,2)","v":7476.5},5267.23,{"$f":"H5-I5","v":2209.2700000000004},{"$f":"SUM(ROUND(I5:J5,2))","v":7476.5}]
["M-2","2","M2G Inc.","Material Type","to lay foundation for equipment",1,29346.17,{"$f":"ROUND(F6*G6,2)","v":29346.17},24391.39,{"$f":"H6-I6","v":4954.7799999999988},{"$f":"SUM(ROUND(I6:J6,2))","v":29346.17}]
[null,null,null,null,null,0,0,0,0,0,{"$f":"SUM(ROUND(I7:J7,2))","v":0}]
[null,null,null,null,null,0,0,0,0,0,{"$f":"SUM(ROUND(I8:J8,2))","v":0}]
[null,null,null,null,null,0,0,0,0,0,{"$f":"SUM(ROUND(I9:J9,2))","v":0}]
[null,null,null,null,null,0,0,0,0,0,{"$f":"SUM(ROUND(I10:J10,2))","v":0}]
{"$rows_left_out":201}
{"sheet":"Subs & Vendors","index":7,"n_rows":216,"n_cols":14,"rows_kept":216,"cut":false,"hidden":false,"merged":[[96,7,97,7],[96,8,97,8],[98,7,99,7],[98,8,99,8],[100,7,101,7],[100,8,101,8],[102,7,103,7],[102,8,103,8],[86,7,87,7],[86,8,87,8],[88,7,89,7],[88,8,89,8],[90,7,91,7],[90,8,91,8],[92,7,93,7],[92,8,93,8],[94,7,95,7],[94,8,95,8],[76,7,77,7],[76,8,77,8],[78,7,79,7],[78,8,79,8],[80,7,81,7],[80,8,81,8],[82,7,83,7],[82,8,83,8],[84,7,85,7],[84,8,85,8],[66,7,67,7],[66,8,67,8],[68,7,69,7],[68,8,69,8],[70,7,71,7],[70,8,71,8],[72,7,73,7],[72,8,73,8],[74,7,75,7],[74,8,75,8],[56,7,57,7],[56,8,57,8],[58,7,59,7],[58,8,59,8],[60,7,61,7],[60,8,61,8],[62,7,63,7],[62,8,63,8],[64,7,65,7],[64,8,65,8],[46,7,47,7],[46,8,47,8],[48,7,49,7],[48,8,49,8],[50,7,51,7],[50,8,51,8],[52,7,53,7],[52,8,53,8],[54,7,55,7],[54,8,55,8],[36,7,37,7],[36,8,37,8],[38,7,39,7],[38,8,39,8],[40,7,41,7],[40,8,41,8],[42,7,43,7],[42,8,43,8],[44,7,45,7],[44,8,45,8],[26,8,27,8],[28,7,29,7],[28,8,29,8],[30,7,31,7],[30,8,31,8],[32,7,33,7],[32,8,33,8],[34,7,35,7],[34,8,35,8],[16,8,17,8],[18,7,19,7],[18,8,19,8],[20,7,21,7],[20,8,21,8],[22,7,23,7],[22,8,23,8],[4,7,5,7],[4,8,5,8],[6,7,7,7],[6,8,7,8],[8,7,9,7],[8,8,9,8],[10,7,11,7],[10,8,11,8],[12,7,13,7],[12,8,13,8],[24,7,25,7],[24,8,25,8],[26,7,27,7],[212,0,212,6],[10,0,11,0],[12,0,13,0],[14,0,15,0],[4,1,5,1],[4,0,5,0],[121,0,122,0],[209,0,210,1],[123,0,124,0],[113,0,114,0],[121,1,122,1],[123,1,124,1],[117,1,118,1],[6,0,7,0],[8,0,9,0],[6,1,7,1],[8,1,9,1],[10,1,11,1],[14,7,15,7],[14,8,15,8],[16,7,17,7],[70,0,71,0],[70,1,71,1],[12,1,13,1],[14,1,15,1],[16,0,17,0],[18,0,19,0],[18,1,19,1],[16,1,17,1],[214,0,215,1],[213,0,213,2],[20,0,21,0],[20,1,21,1],[22,0,23,0],[22,1,23,1],[24,0,25,0],[24,1,25,1],[26,0,27,0],[26,1,27,1],[28,0,29,0],[28,1,29,1],[30,0,31,0],[30,1,31,1],[32,0,33,0],[32,1,33,1],[56,0,57,0],[56,1,57,1],[64,0,65,0],[64,1,65,1],[66,0,67,0],[66,1,67,1],[68,0,69,0],[68,1,69,1],[58,0,59,0],[58,1,59,1],[60,0,61,0],[60,1,61,1],[62,0,63,0],[62,1,63,1],[34,0,35,0],[34,1,35,1],[36,0,37,0],[36,1,37,1],[38,0,39,0],[38,1,39,1],[52,0,53,0],[52,1,53,1],[54,0,55,0],[54,1,55,1],[46,0,47,0],[46,1,47,1],[48,0,49,0],[48,1,49,1],[50,0,51,0],[50,1,51,1],[40,0,41,0],[40,1,41,1],[42,0,43,0],[42,1,43,1],[44,0,45,0],[44,1,45,1],[72,0,73,0],[72,1,73,1],[74,0,75,0],[74,1,75,1],[76,0,77,0],[88,0,89,0],[88,1,89,1],[90,0,91,0],[90,1,91,1],[76,1,77,1],[78,0,79,0],[78,1,79,1],[80,0,81,0],[80,1,81,1],[92,0,93,0],[92,1,93,1],[82,0,83,0],[82,1,83,1],[84,0,85,0],[84,1,85,1],[86,0,87,0],[86,1,87,1],[100,0,101,0],[100,1,101,1],[102,0,103,0],[102,1,103,1],[125,0,126,0],[125,1,126,1],[94,0,95,0],[94,1,95,1],[96,0,97,0],[96,1,97,1],[98,0,99,0],[98,1,99,1],[119,0,120,0],[109,0,110,0],[109,1,110,1],[107,0,107,6],[115,1,116,1],[115,0,116,0],[119,1,120,1],[104,0,105,1],[111,1,112,1],[113,1,114,1],[117,0,118,0],[111,0,112,0],[133,0,134,0],[133,1,134,1],[135,0,136,0],[135,1,136,1],[137,0,138,0],[137,1,138,1],[127,0,128,0],[127,1,128,1],[129,0,130,0],[129,1,130,1],[131,0,132,0],[131,1,132,1],[145,0,146,0],[145,1,146,1],[147,0,148,0],[147,1,148,1],[149,0,150,0],[149,1,150,1],[139,0,140,0],[139,1,140,1],[141,0,142,0],[141,1,142,1],[143,0,144,0],[143,1,144,1],[157,0,158,0],[157,1,158,1],[159,0,160,0],[159,1,160,1],[161,0,162,0],[161,1,162,1],[151,0,152,0],[151,1,152,1],[153,0,154,0],[153,1,154,1],[155,0,156,0],[155,1,156,1],[169,0,170,0],[169,1,170,1],[171,0,172,0],[171,1,172,1],[173,0,174,0],[173,1,174,1],[163,0,164,0],[163,1,164,1],[165,0,166,0],[165,1,166,1],[167,0,168,0],[167,1,168,1],[191,1,192,1],[181,0,182,0],[181,1,182,1],[183,0,184,0],[183,1,184,1],[185,0,186,0],[185,1,186,1],[175,0,176,0],[175,1,176,1],[177,0,178,0],[177,1,178,1],[179,0,180,0],[179,1,180,1],[2,0,2,8],[1,0,1,8],[0,0,0,8],[205,0,206,0],[205,1,206,1],[207,0,208,0],[207,1,208,1],[199,0,200,0],[199,1,200,1],[201,0,202,0],[201,1,202,1],[203,0,204,0],[203,1,204,1],[193,0,194,0],[193,1,194,1],[195,0,196,0],[195,1,196,1],[197,0,198,0],[197,1,198,1],[187,0,188,0],[187,1,188,1],[189,0,190,0],[189,1,190,1],[191,0,192,0]]}
["TRAINING INVOICE",null,null,null,null,null,null,null,null,null,null,null,null,"SANDBOX AREA (highlighted in light red)- For rough work associated with the print area to the left.  Rough work may include, notes, calculations, derivations, etc."]
["SUBRECIPIENTS AND VENDORS"]
["Subrecipients Summary"]
["Budget Worksheet Reference ID","Subrecipient Name","Funding Category","Subrecipient Agreement  Budget","Subrecipient  Request This Period","Subrecipient Cumulative Expenses Billed to Date","Subrecipient  Balance","Subrecipient Exempt from Retention?","Billed CEC\nExpenses\nwithout Retention"]
["S-1","M&M, Inc.","CEC",50000,9257.26,15636.523999999999,{"$f":"ROUND(D5,2)-ROUND(F5,2)","v":34363.479999999996},"No",{"$f":"IF(H5=\"Yes\",ROUND(E5,2),0)","v":0}]
[null,null,"Match",30000,5137.6099999999997,7717.5499999999993,{"$f":"ROUND(D6,2)-ROUND(F6,2)","v":22282.45}]
["S-1","ABC National Lab","CEC",50000,11635.71,17103.939999999999,32896.06,"Yes",{"$f":"IF(H7=\"Yes\",ROUND(E7,2),0)","v":11635.71}]
[null,null,"Match",40000,8267.43,9952.2999999999993,30047.7]
[null,"Subrecipient 3","CEC",0,0,0,0,"Select Yes or No",{"$f":"IF(H9=\"Yes\",ROUND(E9,2),0)","v":0}]
[null,null,"Match",0,0,0,0]
{"$rows_left_out":207}
{"sheet":"Indirect Costs & Profit","index":8,"n_rows":160,"n_cols":17,"rows_kept":160,"cut":false,"hidden":false,"merged":[[0,0,0,11],[1,0,1,11],[2,0,2,11],[4,0,10,0],[4,4,10,4],[4,5,10,5],[4,6,10,6],[4,7,10,7],[4,8,10,8],[4,9,10,9],[4,10,10,10],[4,11,10,11],[11,0,17,0],[11,4,17,4],[11,5,17,5],[11,6,17,6],[11,7,17,7],[11,8,17,8],[11,9,17,9],[11,10,17,10],[11,11,17,11],[18,0,24,0],[18,4,24,4],[18,5,24,5],[18,6,24,6],[18,7,24,7],[18,8,24,8],[18,9,24,9],[18,10,24,10],[18,11,24,11],[25,0,31,0],[25,4,31,4],[25,5,31,5],[25,6,31,6],[25,7,31,7],[25,8,31,8],[25,9,31,9],[25,10,31,10],[25,11,31,11],[32,0,38,0],[32,4,38,4],[32,5,38,5],[32,6,38,6],[32,7,38,7],[32,8,38,8],[32,9,38,9],[32,10,38,10],[32,11,38,11],[39,9,45,9],[39,10,45,10],[39,11,45,11],[46,0,52,0],[46,4,52,4],[46,5,52,5],[46,6,52,6],[46,7,52,7],[46,8,52,8],[46,9,52,9],[39,0,45,0],[39,4,45,4],[39,5,45,5],[39,6,45,6],[39,7,45,7],[39,8,45,8],[46,10,52,10],[46,11,52,11],[53,0,59,0],[53,4,59,4],[53,5,59,5],[53,6,59,6],[53,7,59,7],[53,8,59,8],[53,9,59,9],[53,10,59,10],[53,11,59,11],[60,0,66,0],[60,4,66,4],[60,5,66,5],[60,6,66,6],[60,7,66,7],[60,8,66,8],[60,9,66,9],[60,10,66,10],[60,11,66,11],[67,9,73,9],[67,10,73,10],[67,11,73,11],[74,0,80,0],[74,4,80,4],[74,5,80,5],[74,6,80,6],[74,7,80,7],[74,8,80,8],[74,9,80,9],[67,0,73,0],[67,4,73,4],[67,5,73,5],[67,6,73,6],[67,7,73,7],[67,8,73,8],[74,10,80,10],[74,11,80,11],[81,0,87,0],[81,4,87,4],[81,5,87,5],[81,6,87,6],[81,7,87,7],[81,8,87,8],[81,9,87,9],[81,10,87,10],[81,11,87,11],[88,0,94,0],[88,4,94,4],[88,5,94,5],[88,6,94,6],[88,7,94,7],[88,8,94,8],[88,9,94,9],[88,10,94,10],[88,11,94,11],[95,9,101,9],[95,10,101,10],[95,11,101,11],[102,0,108,0],[102,4,108,4],[102,5,108,5],[102,6,108,6],[102,7,108,7],[102,8,108,8],[102,9,108,9],[95,0,101,0],[95,4,101,4],[95,5,101,5],[95,6,101,6],[95,7,101,7],[95,8,101,8],[102,10,108,10],[102,11,108,11],[109,0,115,0],[109,4,115,4],[109,5,115,5],[109,6,115,6],[109,7,115,7],[109,8,115,8],[109,9,115,9],[109,10,115,10],[109,11,115,11],[116,0,122,0],[116,4,122,4],[116,5,122,5],[116,6,122,6],[116,7,122,7],[116,8,122,8],[116,9,122,9],[116,10,122,10],[116,11,122,11],[123,9,129,9],[123,10,129,10],[123,11,129,11],[130,0,136,0],[130,4,136,4],[130,5,136,5],[130,6,136,6],[130,7,136,7],[130,8,136,8],[130,9,136,9],[123,0,129,0],[123,4,129,4],[123,5,129,5],[123,6,129,6],[123,7,129,7],[123,8,129,8],[130,10,136,10],[130,11,136,11],[137,0,143,0],[137,4,143,4],[137,5,143,5],[137,6,143,6],[137,7,143,7],[137,8,143,8],[137,9,143,9],[137,10,143,10],[137,11,143,11],[144,0,144,8],[146,0,146,11],[147,0,147,1],[148,0,148,1],[148,4,154,4],[148,5,154,5],[148,6,154,6],[148,7,154,7],[148,8,154,8],[155,0,155,8],[157,0,157,11],[158,0,158,11],[159,0,159,11],[148,9,154,9],[148,10,154,10],[148,11,154,11],[149,0,149,1],[150,0,150,1],[151,0,151,1],[152,0,152,1],[153,0,153,1],[154,0,154,1]]}
["TRAINING INVOICE",null,null,null,null,null,null,null,null,null,null,null,null,null,null,null,"SANDBOX AREA (highlighted in light red)- For rough work associated with the print area to the left.  Rough work may include, notes, calculations, derivations, etc."]
["Indirect Costs and Profit"]
["Indirect Cost(s)"]
["Name of Indirect Cost","Indirect Cost (IDC) Base Category","IDC Base\nCEC Share\nBilled\nThis Period ($)","IDC Base\nMatch Share\nExpenses\nThis Period ($)","Total \nIDC Base\nCEC Share\nBilled\nThis Period ($)","Total \nIDC Base\nMatch Share\nExpenses\nThis Period ($)","Total IDC Base\nBilled/Match\nThis Period ($)","IDC Actual Rate\nBilled/Match\nThis Period (%)","Rate x Base ($)","Billed\nCEC Expenses","Match \nShare\nExpenses","Total"]
["Overhead","Direct Labor",{"$f":"'Invoice Summary'!$C$13","v":10972.9},{"$f":"'Invoice Summary'!$C$25","v":2000},{"$f":"SUM(ROUND(C5,2),ROUND(C6,2),ROUND(C7,2),ROUND(C8,2),ROUND(C9,2),ROUND(C10,2),ROUND(C11,2))","v":67195.239999999991},{"$f":"SUM(ROUND(D5,2),ROUND(D6,2),ROUND(D7,2),ROUND(D8,2),ROUND(D9,2),ROUND(D10,2),ROUND(D11,2))","v":24084.440000000002},{"$f":"SUM(E5,F5)","v":91279.679999999993},0.2,{"$f":"ROUND($G5*H5,2)","v":18255.939999999999},{"$f":"6136.53+0.01","v":6136.54},1620,{"$f":"ROUND($J5,2)+ROUND($K5,2)","v":7756.54}]
[null,"Fringe Benefits",{"$f":"'Invoice Summary'!$C$14","v":4609.76},{"$f":"'Invoice Summary'!$C$26","v":600}]
[null,"Travel",{"$f":"'Invoice Summary'!$C$15","v":78.63},{"$f":"'Invoice Summary'!$C$27","v":21.56}]
[null,"Equipment",0,0]
[null,"Materials/Misc.",{"$f":"'Invoice Summary'!$C$17","v":29658.62},{"$f":"'Invoice Summary'!$C$29","v":7164.0499999999993}]
[null,"Subrecipients/Vendors",{"$f":"'Invoice Summary'!$C$18","v":21875.33},{"$f":"'Invoice Summary'!$C$30","v":14298.830000000002}]
{"$rows_left_out":151}
{"sheet":"Lists","index":9,"n_rows":20,"n_cols":1,"rows_kept":20,"cut":false,"hidden":true,"merged":[]}
["Retention Method Selection"]
["Select a Retention Method"]
["Retention will be withheld at the end of the agreement (minus exempt subrecipients)"]
["Retention will be withheld from each invoice (minus exempt subrecipients)"]
["Retention is NOT required to be withheld for this agreement"]
[]
["End of Agreement Retention Method Situation"]
["If Applicable: \nSelect End of Agreement Retention Method Situation"]
["90.00%, or less, of CEC funds spent to date (minus exempt subrecipients), including this invoice"]
["With this invoice, percentage of CEC funds spent (minus exempt subrecipients) will transition from less than to greater than 90.00% [manually enter required retention amount below]"]
{"$rows_left_out":10}