{"text_format":"1","workbook":"xlsx","n_sheets":7,"sheets":["Instructions","Invoice Payment Cover Sheet","Invoice Summary","Equipment","Materials & Miscellaneous","Subs & Vendors","Lists"],"not_rendered":{"charts":0,"images":0,"macros":0,"external_links":0,"defined_names":10,"comments":0,"pivot_tables":0},"unopened":[],"bounds":{"document_bytes":16777216,"sheet_cells":100000,"rows_first":2000,"rows_last":500,"rows_between":2000,"halvings":0,"cell_chars":16384,"cell_head_chars":4096},"cells_cut":0,"cells_raw":0,"read":"whole","date_system":"1900"}

{"sheet":"Instructions","index":0,"n_rows":20,"n_cols":6,"rows_kept":20,"cut":false,"hidden":false,"merged":[]}
["Workbook Instructions",null,null,null,null,"SANDBOX AREA (highlighted in light red)- For rough work associated with the print area to the left.  Rough work may include, notes, calculations, derivations, etc."]
["Enter information as required in all cells highlighted in Blue."]
["All cells not highlighted in Blue are locked from editing.  Locked cells include:  cells with formulas highlighted in Gray or Light Yellow, cells with no color fill (white), etc."]
["Rules for decimal places on values:"]
["·         Budget and Invoice values:"]
["o   Rounding of any values, as described below, should be performed using standard rounding practices."]
["o   For all currency rates (e.g., Direct Labor, and Unit Cost):  Round to the cent ($0.01)."]
["o   For all percentage rates (e.g., Fringe Benefits, Indirect Cost, and Profit):  Round to a maximum of two decimal places of a percent (e.g., 25.12%).  You can round to less if desired, such as one decimal place (e.g., 25.1%), or zero decimal places (e.g., 25%)."]
["o   For all quantity values (e.g., # of hours, # of months, and # of units):  Round to a maximum of two decimal places (e.g., 50.12).  You can round to less if desired, such as one decimal place (e.g., 50.1), or zero decimal places (e.g., 50)."]
["·         Budget values:"]
["o   For entered and totaled (via calculation) CEC and Match share budget values:  Round to the dollar ($1)."]
["o   For all calculated currency values (e.g., rate x hours, rate x months, base amount, and rate x base amount):  Round to the dollar ($1)."]
["·         Invoice values:"]
["o   For entered and totaled (via calculation) CEC and Match share expense invoice values:  Round to the cent ($0.01)."]
["o   For all calculated currency values (e.g., rate x hours, rate x months, base amount, and rate x base amount):  Round to the cent ($0.01)."]
["o   SPECIAL CIRCUMSTANCE for calculated currency values:  ONLY if a calculated value (e.g., rate x hours = actual labor expense) does NOT equal the actual expense, because of the decimal place rules provided for rates and quantity values listed above, it is acceptable to use as many decimal places as necessary for rates and quantity values listed above to ensure that the calculated value DOES equal the actual expense."]
["If additional rows are needed within a section, unhide the hidden rows (i.e., select the row directly above and below the hidden rows, then right-click the selection and select “Unhide”).  Hide any unused rows.  DO NOT USE THE LAST TWO ROWS THAT ARE MARKED “CEC USE ONLY”.  If all but the last 2 rows are used, and more rows are required, please contact the ECAMS Support team (ECAMS.Support@energy.ca.gov)."]
["FOR ECAMS SUPPORT TEAM ONLY:  To add additional rows and maintain the formulas within the totals, (1) unprotect the sheet, (2) copy the second to the last row in the section, (3) insert the copied row just above the last row, (4) repeat steps 2 - 3 as required, (5) correct formatting and REFERRENCE IDs as required, (6) delete “CEC USE ONLY” from all but the last two rows in the section, and (7) re-protect the sheet."]
["For support on how to complete this template, please visit the ECAMS Resources web page.  The link to this web page is provided in the cell below:"]
["https://www.energy.ca.gov/funding-opportunities/funding-resources/ecams-resources"]

{"sheet":"Invoice Payment Cover Sheet","index":1,"n_rows":45,"n_cols":9,"rows_kept":45,"cut":false,"hidden":false,"merged":[[43,0,43,1],[27,0,27,3],[42,2,42,3],[35,0,35,3],[44,2,44,3],[43,2,43,3],[44,0,44,1],[42,0,42,1]]}
["Invoice Payment Request",null,null,null,null,null,null,null,"SANDBOX AREA (highlighted in light red)- For rough work associated with the print area to the left.  Rough work may include, notes, calculations, derivations, etc."]
[]
["Insert Company Logo"]
[]
["Physical Address:",null,"Bill To:"]
["Company Name",null,"California Energy Commission"]
["Company Address 1",null,"Accounting Office, MS-2"]
["Company Address 2",null,"1516 Ninth Street"]
["City, State, Zip",null,"Sacramento, CA 95814"]
[]
["Remit Payment To:",null,"Agreement Number:","xxx-xx-xxx"]
["Company Name",null,"Invoice Date:","mm/dd/yyyy"]
["Company Address 1",null,"Invoice Number:","ABC-YY-###-##"]
["Company Address 2",null,"Company Tracking Number (optional):","##########"]
["City, State, Zip",null,"Period Covered by Request:","mm/dd/yyyy - mm/dd/yyyy"]
[]
["Federal Tax ID:",null,"Total to Pay This Invoice:",{"$f":"'Invoice Summary'!C39","v":604464.05000000005}]
["##########"]
[]
["CEC Email Address to Submit Invoices",null,"Funding Source Line Items:","Amount:"]
["invoices@energy.ca.gov",null,"1. Grant or Loan Progress Payment.  Amount Only.",{"$f":"D17","v":604464.05000000005}]
[]
[]
[]
[]
[]
["Certification"]
["I certify under penalty of perjury that this invoice is accurate and conforms to the requirements of this agreement.  Reimbursement for these costs has not and will not be received from any other sources.  I have carefully reviewed the terms and conditions for this agreement and have determined that, for work covered by this invoice, the recipient and all subrecipients have complied with all agreement terms, including the requirement of compliance with public works and prevailing wage laws, which when applicable require, among other things, the payment of prevailing wages to eligible workers. All invoice backup documentation (e.g. receipts, invoices, etc.) is available upon request for any items at any time.  All invoiced amounts, including indirect cost rates, are for actual and allowable expenditures under this agreement. "]
[]
[]
{"$rows_left_out":16}
{"sheet":"Invoice Summary","index":2,"n_rows":41,"n_cols":11,"rows_kept":41,"cut":false,"hidden":false,"merged":[[3,2,3,5],[5,2,5,5],[7,2,7,5],[7,0,7,1],[0,0,0,5],[2,0,2,1],[2,2,2,5],[3,0,3,1],[6,2,6,5],[5,0,5,1],[4,0,4,1],[4,2,4,5],[6,0,6,1],[36,3,36,4],[38,3,38,4],[39,3,39,5],[8,1,8,5],[40,3,40,4],[41,0,41,5],[10,0,10,5],[22,0,22,5],[36,0,36,1],[40,0,40,1],[37,0,37,1],[38,0,38,1],[37,3,37,4]]}
["Energy Commission Grant Invoice\nSummary by Category Budget",null,null,null,null,null,null,null,null,null,"SANDBOX AREA (highlighted in light red)- For rough work associated with the print area to the left.  Rough work may include, notes, calculations, derivations, etc."]
[]
["Company Name:",null,{"$f":"'Invoice Payment Cover Sheet'!A6","v":"Company Name"}]
["Agreement Number:",null,{"$f":"'Invoice Payment Cover Sheet'!D11","v":"xxx-xx-xxx"}]
["Invoice Date:",null,{"$f":"'Invoice Payment Cover Sheet'!D12","v":"mm/dd/yyyy"}]
["Invoice Number:",null,{"$f":"'Invoice Payment Cover Sheet'!D13","v":"ABC-YY-###-##"}]
["Company Tracking Number (optional):",null,{"$f":"IF('Invoice Payment Cover Sheet'!D14=\"\",\"\",'Invoice Payment Cover Sheet'!D14)","v":"##########"}]
["Period Covered by this Request:",null,{"$f":"'Invoice Payment Cover Sheet'!D15","v":"mm/dd/yyyy - mm/dd/yyyy"}]
["Retention Method:","Select a Retention Method"]
[]
["CEC Reimbursable Summary"]
["Category","Agreement Reimbursable Budget","Reimbursable Expenses This Period","Cumulative Expenses Billed to Date","% of Reimbursable Spent to Date","Reimbursable Balance"]
["Direct Labor",320500,10972.9,{"$f":"10972.9+29346.28","v":40319.18},{"$f":"IF($B13=0,0,ROUND($D13,2)/ROUND($B13,0))","v":0.12580087363494541},{"$f":"B13-D13","v":280180.82}]
["Fringe Benefits",179250,4609.76,{"$f":"4609.75+5976.23","v":10585.98},{"$f":"IF($B14=0,0,ROUND($D14,2)/ROUND($B14,0))","v":5.9057071129707109E-2},{"$f":"B14-D14","v":168664.02}]
["Travel",500,78.63,{"$f":"78.63+29.25","v":107.88},0.21575999999999998,392.12]
["Equipment",657000,{"$f":"Equipment!I207","v":529553.89},{"$f":"529553.89+15367.16","v":544921.05000000005},0.82940799086757999,112078.94999999995]
["Materials/Misc.",35000,{"$f":"'Materials & Miscellaneous'!I207","v":29658.62},{"$f":"29658.62+3216.59","v":32875.21},0.93929171428571423,2124.7900000000009]
["Subs/Vendors",{"$f":"'Subs & Vendors'!D215","v":101000},{"$f":"'Subs & Vendors'!E215","v":21875.33},{"$f":"'Subs & Vendors'!F215","v":32740.46},0.32416297029702967,68259.540000000008]
["Indirect Costs",117051,6156.65,{"$f":"6156.65+7613.81","v":13770.46},0.11764495818062211,103280.54000000001]
["Profit",49975,1558.27,{"$f":"1558.27+2364.17","v":3922.44},7.8488044022011011E-2,46052.56]
["Total",{"$f":"SUM(ROUND(B13:B20,0))","v":1460276},{"$f":"SUM(C13:C20)","v":604464.05000000005},{"$f":"SUM(ROUND(D13:D20,2))","v":679242.65999999992},0.46514676677559585,781033.34000000008]
[]
["Match Share Summary"]
["Category","Agreement Match Share Budget","Match Share Expenses This Period","Cumulative Match Share Spent to Date","% of Match Spent to Date","Match Balance"]
["Direct Labor",8000,2000,{"$f":"2000+256","v":2256},{"$f":"IF($B25=0,0,ROUND($D25,2)/ROUND($B25,0))","v":0.28199999999999997},{"$f":"B25-D25","v":5744}]
["Fringe Benefits",28000,600,{"$f":"600+6423","v":7023},0.25082142857142858,20977]
["Travel",200,21.56,{"$f":"21.56+26.49","v":48.05},0.24024999999999999,151.94999999999999]
["Equipment",58000,{"$f":"Equipment!J207","v":54452.57},{"$f":"54452.57","v":54452.57},0.93883741379310348,3547.4300000000003]
["Materials/Misc.",10000,{"$f":"'Materials & Miscellaneous'!J207","v":7164.0499999999993},{"$f":"7164.05+1238.19","v":8402.24},0.84022399999999997,1597.7600000000002]
["Subs/Vendors",{"$f":"'Subs & Vendors'!D216","v":71000},{"$f":"'Subs & Vendors'!E216","v":14298.830000000002},{"$f":"'Subs & Vendors'!F216","v":17669.849999999999},0.24887112676056336,53330.15]
{"$rows_left_out":12}
{"sheet":"Equipment","index":3,"n_rows":211,"n_cols":18,"rows_kept":211,"cut":false,"hidden":false,"merged":[[2,2,3,2],[2,4,3,4],[1,0,1,12],[0,0,0,12],[209,0,209,12],[210,0,210,12],[2,11,2,12],[2,0,3,0],[2,1,3,1],[2,3,3,3],[2,5,3,5],[2,6,3,6],[2,7,3,7],[2,8,3,8],[2,9,3,9],[2,10,3,10],[206,0,206,6],[208,0,208,12],[206,11,206,12]]}
["INVOICE",null,null,null,null,null,null,null,null,null,null,null,null,null,null,null,null,"SANDBOX AREA (highlighted in light red)- For rough work associated with the print area to the left.  Rough work may include, notes, calculations, derivations, etc."]
["EQUIPMENT"]
["Budget Worksheet Reference ID","Task #","Legal Name of entity providing equipment: Recipient/ Subrecipient/ Vendor","Description","Purpose","# of Units\nBilled/Match","Unit Cost\nBilled/Match \nThis Period ($)","Total:  \n# of Units x Unit Cost","Billed\nCEC\nExpenses","Match \nShare\nExpenses","Total","Use If Requesting Payment for Incurred Costs or Reimbursement for Partial Payments"]
[null,null,null,null,null,null,null,null,null,null,null,"Check Box if Expense is a Partial Payment","Provide payment amount(s) and CEC invoice number(s) for prior payment(s)"]
["E-1",4,"M&M Inc.","Equipment Type A","Needed to help complete project",5,27697.45,{"$f":"ROUND(F5*G5,2)","v":138487.25},{"$f":"H5-100000-25000","v":13487.25},25000,{"$f":"SUM(ROUND(I5:J5,2))","v":38487.25},null,"$100,000 on invoice 9"]
["E-2",2,"Equipment Inc.","Equipment Type B","Needed to help complete project",11,48239.11,{"$f":"ROUND(F6*G6,2)","v":530630.21},{"$f":"530630.21-21563.57","v":509066.63999999996},21563.57,{"$f":"SUM(ROUND(I6:J6,2))","v":530630.21}]
["E-3",2,"Equipment Inc.","Equipment Type C","Needed to help complete project",3,4963,14889,7000,{"$f":"H7-7000","v":7889},{"$f":"SUM(ROUND(I7:J7,2))","v":14889}]
[null,null,null,null,null,0,0,0,0,0,{"$f":"SUM(ROUND(I8:J8,2))","v":0}]
[null,null,null,null,null,0,0,0,0,0,{"$f":"SUM(ROUND(I9:J9,2))","v":0}]
[null,null,null,null,null,0,0,0,0,0,{"$f":"SUM(ROUND(I10:J10,2))","v":0}]
[null,null,null,null,null,0,0,0,0,0,{"$f":"SUM(ROUND(I11:J11,2))","v":0}]
[null,null,null,null,null,0,0,0,0,0,{"$f":"SUM(ROUND(I12:J12,2))","v":0}]
[null,null,null,null,null,0,0,0,0,0,{"$f":"SUM(ROUND(I13:J13,2))","v":0}]
[null,null,null,null,null,0,0,0,0,0,{"$f":"SUM(ROUND(I14:J14,2))","v":0}]
[null,null,null,null,null,0,0,0,0,0,{"$f":"SUM(ROUND(I15:J15,2))","v":0}]
[null,null,null,null,null,0,0,0,0,0,{"$f":"SUM(ROUND(I16:J16,2))","v":0}]
[null,null,null,null,null,0,0,0,0,0,{"$f":"SUM(ROUND(I17:J17,2))","v":0}]
[null,null,null,null,null,0,0,0,0,0,{"$f":"SUM(ROUND(I18:J18,2))","v":0}]
[null,null,null,null,null,0,0,0,0,0,{"$f":"SUM(ROUND(I19:J19,2))","v":0}]
[null,null,null,null,null,0,0,0,0,0,{"$f":"SUM(ROUND(I20:J20,2))","v":0}]
[null,null,null,null,null,0,0,0,0,0,{"$f":"SUM(ROUND(I21:J21,2))","v":0}]
[null,null,null,null,null,0,0,0,0,0,{"$f":"SUM(ROUND(I22:J22,2))","v":0}]
[null,null,null,null,null,0,0,0,0,0,{"$f":"SUM(ROUND(I23:J23,2))","v":0}]
[null,null,null,null,null,0,0,{"$f":"ROUND(F24*G24,2)","v":0},0,0,{"$f":"SUM(ROUND(I24:J24,2))","v":0}]
[null,null,null,null,null,0,0,0,0,0,{"$f":"SUM(ROUND(I25:J25,2))","v":0}]
[null,null,null,null,null,0,0,0,0,0,{"$f":"SUM(ROUND(I26:J26,2))","v":0}]
[null,null,null,null,null,0,0,0,0,0,{"$f":"SUM(ROUND(I27:J27,2))","v":0}]
[null,null,null,null,null,0,0,0,0,0,{"$f":"SUM(ROUND(I28:J28,2))","v":0}]
[null,null,null,null,null,0,0,0,0,0,{"$f":"SUM(ROUND(I29:J29,2))","v":0}]
[null,null,null,null,null,0,0,0,0,0,{"$f":"SUM(ROUND(I30:J30,2))","v":0}]
{"$rows_left_out":182}
{"sheet":"Materials & Miscellaneous","index":4,"n_rows":210,"n_cols":18,"rows_kept":210,"cut":false,"hidden":false,"merged":[[0,0,0,12],[1,0,1,12],[209,0,209,12],[2,11,2,12],[2,10,3,10],[2,9,3,9],[2,8,3,8],[2,4,3,4],[2,3,3,3],[2,1,3,1],[2,0,3,0],[2,2,3,2],[2,5,3,5],[2,6,3,6],[208,0,208,12],[2,7,3,7],[206,0,206,6]]}
["INVOICE",null,null,null,null,null,null,null,null,null,null,null,null,null,null,null,null,"SANDBOX AREA (highlighted in light red)- For rough work associated with the print area to the left.  Rough work may include, notes, calculations, derivations, etc."]
["MATERIALS & MISCELLANEOUS"]
["Budget Worksheet Reference ID","Task #","Legal Name of entity providing the item(s): Recipient/ Subrecipient/ Vendor","Description","Purpose","# of Units\nBilled/ Match","Unit Cost\nBilled/Match \nThis Period ($)","Total:  \n# of Units x Unit Cost","Billed\nCEC Expenses","Match \nShare\nExpenses","Total","Use If Requesting Payment for Incurred Costs or Reimbursement for Partial Payments"]
[null,null,null,null,null,null,null,null,null,null,null,"Check Box if Expense is a Partial Payment","Provide payment amount(s) and CEC invoice number(s) for prior payment(s)"]
["M-1",1,"Materials LLC","Material Type Z","to build item for project",50,149.53,{"$f":"ROUND(F5*G5,2)","v":7476.5},5267.23,{"$f":"H5-I5","v":2209.2700000000004},{"$f":"SUM(ROUND(I5:J5,2))","v":7476.5}]
["M-2","2","M2G Inc.","Material Type","to lay foundation for equipment",1,29346.17,{"$f":"ROUND(F6*G6,2)","v":29346.17},24391.39,{"$f":"H6-I6","v":4954.7799999999988},{"$f":"SUM(ROUND(I6:J6,2))","v":29346.17}]
[null,null,null,null,null,0,0,0,0,0,{"$f":"SUM(ROUND(I7:J7,2))","v":0}]
[null,null,null,null,null,0,0,0,0,0,{"$f":"SUM(ROUND(I8:J8,2))","v":0}]
[null,null,null,null,null,0,0,0,0,0,{"$f":"SUM(ROUND(I9:J9,2))","v":0}]
[null,null,null,null,null,0,0,0,0,0,{"$f":"SUM(ROUND(I10:J10,2))","v":0}]
[null,null,null,null,null,0,0,0,0,0,{"$f":"SUM(ROUND(I11:J11,2))","v":0}]
[null,null,null,null,null,0,0,0,0,0,{"$f":"SUM(ROUND(I12:J12,2))","v":0}]
[null,null,null,null,null,0,0,0,0,0,{"$f":"SUM(ROUND(I13:J13,2))","v":0}]
[null,null,null,null,null,0,0,0,0,0,{"$f":"SUM(ROUND(I14:J14,2))","v":0}]
[null,null,null,null,null,0,0,0,0,0,{"$f":"SUM(ROUND(I15:J15,2))","v":0}]
[null,null,null,null,null,0,0,0,0,0,{"$f":"SUM(ROUND(I16:J16,2))","v":0}]
[null,null,null,null,null,0,0,0,0,0,{"$f":"SUM(ROUND(I17:J17,2))","v":0}]
[null,null,null,null,null,0,0,0,0,0,{"$f":"SUM(ROUND(I18:J18,2))","v":0}]
[null,null,null,null,null,0,0,0,0,0,{"$f":"SUM(ROUND(I19:J19,2))","v":0}]
[null,null,null,null,null,0,0,0,0,0,{"$f":"SUM(ROUND(I20:J20,2))","v":0}]
[null,null,null,null,null,0,0,0,0,0,{"$f":"SUM(ROUND(I21:J21,2))","v":0}]
[null,null,null,null,null,0,0,0,0,0,{"$f":"SUM(ROUND(I22:J22,2))","v":0}]
[null,null,null,null,null,0,0,0,0,0,{"$f":"SUM(ROUND(I23:J23,2))","v":0}]
[null,null,null,null,null,0,0,{"$f":"ROUND(F24*G24,2)","v":0},0,0,{"$f":"SUM(ROUND(I24:J24,2))","v":0}]
[null,null,null,null,null,0,0,0,0,0,{"$f":"SUM(ROUND(I25:J25,2))","v":0}]
[null,null,null,null,null,0,0,0,0,0,{"$f":"SUM(ROUND(I26:J26,2))","v":0}]
[null,null,null,null,null,0,0,0,0,0,{"$f":"SUM(ROUND(I27:J27,2))","v":0}]
[null,null,null,null,null,0,0,0,0,0,{"$f":"SUM(ROUND(I28:J28,2))","v":0}]
[null,null,null,null,null,0,0,0,0,0,{"$f":"SUM(ROUND(I29:J29,2))","v":0}]
[null,null,null,null,null,0,0,0,0,0,{"$f":"SUM(ROUND(I30:J30,2))","v":0}]
{"$rows_left_out":181}
{"sheet":"Subs & Vendors","index":5,"n_rows":216,"n_cols":14,"rows_kept":216,"cut":false,"hidden":false,"merged":[[2,0,2,8],[1,0,1,8],[0,0,0,8],[94,7,95,7],[94,8,95,8],[96,7,97,7],[96,8,97,8],[98,7,99,7],[98,8,99,8],[100,7,101,7],[100,8,101,8],[102,7,103,7],[102,8,103,8],[84,7,85,7],[84,8,85,8],[86,7,87,7],[86,8,87,8],[88,7,89,7],[88,8,89,8],[90,7,91,7],[90,8,91,8],[92,7,93,7],[92,8,93,8],[74,7,75,7],[74,8,75,8],[76,7,77,7],[76,8,77,8],[78,7,79,7],[78,8,79,8],[80,7,81,7],[80,8,81,8],[82,7,83,7],[82,8,83,8],[64,7,65,7],[64,8,65,8],[66,7,67,7],[66,8,67,8],[68,7,69,7],[68,8,69,8],[70,7,71,7],[70,8,71,8],[72,7,73,7],[72,8,73,8],[54,7,55,7],[54,8,55,8],[56,7,57,7],[56,8,57,8],[58,7,59,7],[58,8,59,8],[60,7,61,7],[60,8,61,8],[62,7,63,7],[62,8,63,8],[44,7,45,7],[44,8,45,8],[46,7,47,7],[46,8,47,8],[48,7,49,7],[48,8,49,8],[50,7,51,7],[50,8,51,8],[52,7,53,7],[52,8,53,8],[34,7,35,7],[34,8,35,8],[36,7,37,7],[36,8,37,8],[38,7,39,7],[38,8,39,8],[40,7,41,7],[40,8,41,8],[42,7,43,7],[42,8,43,8],[24,7,25,7],[24,8,25,8],[26,7,27,7],[26,8,27,8],[28,7,29,7],[28,8,29,8],[30,7,31,7],[30,8,31,8],[32,7,33,7],[32,8,33,8],[14,7,15,7],[14,8,15,8],[16,7,17,7],[16,8,17,8],[18,7,19,7],[18,8,19,8],[20,7,21,7],[20,8,21,8],[22,7,23,7],[22,8,23,8],[4,7,5,7],[4,8,5,8],[6,7,7,7],[6,8,7,8],[8,7,9,7],[8,8,9,8],[10,7,11,7],[10,8,11,8],[12,7,13,7],[12,8,13,8],[205,0,206,0],[205,1,206,1],[207,0,208,0],[207,1,208,1],[199,0,200,0],[199,1,200,1],[201,0,202,0],[201,1,202,1],[203,0,204,0],[203,1,204,1],[193,0,194,0],[193,1,194,1],[195,0,196,0],[195,1,196,1],[197,0,198,0],[197,1,198,1],[187,0,188,0],[187,1,188,1],[189,0,190,0],[189,1,190,1],[191,0,192,0],[191,1,192,1],[181,0,182,0],[181,1,182,1],[183,0,184,0],[183,1,184,1],[185,0,186,0],[185,1,186,1],[175,0,176,0],[175,1,176,1],[177,0,178,0],[177,1,178,1],[179,0,180,0],[179,1,180,1],[169,0,170,0],[169,1,170,1],[171,0,172,0],[171,1,172,1],[173,0,174,0],[173,1,174,1],[163,0,164,0],[163,1,164,1],[165,0,166,0],[165,1,166,1],[167,0,168,0],[167,1,168,1],[157,0,158,0],[157,1,158,1],[159,0,160,0],[159,1,160,1],[161,0,162,0],[161,1,162,1],[151,0,152,0],[151,1,152,1],[153,0,154,0],[153,1,154,1],[155,0,156,0],[155,1,156,1],[145,0,146,0],[145,1,146,1],[147,0,148,0],[147,1,148,1],[149,0,150,0],[149,1,150,1],[139,0,140,0],[139,1,140,1],[141,0,142,0],[141,1,142,1],[143,0,144,0],[143,1,144,1],[133,0,134,0],[133,1,134,1],[135,0,136,0],[135,1,136,1],[137,0,138,0],[137,1,138,1],[127,0,128,0],[127,1,128,1],[129,0,130,0],[129,1,130,1],[131,0,132,0],[131,1,132,1],[100,0,101,0],[100,1,101,1],[102,0,103,0],[102,1,103,1],[125,0,126,0],[125,1,126,1],[94,0,95,0],[94,1,95,1],[96,0,97,0],[96,1,97,1],[98,0,99,0],[98,1,99,1],[119,0,120,0],[109,0,110,0],[109,1,110,1],[107,0,107,6],[115,1,116,1],[115,0,116,0],[119,1,120,1],[88,0,89,0],[88,1,89,1],[90,0,91,0],[90,1,91,1],[92,0,93,0],[92,1,93,1],[82,0,83,0],[82,1,83,1],[84,0,85,0],[84,1,85,1],[86,0,87,0],[86,1,87,1],[76,1,77,1],[78,0,79,0],[78,1,79,1],[80,0,81,0],[80,1,81,1],[70,0,71,0],[70,1,71,1],[72,0,73,0],[72,1,73,1],[74,0,75,0],[74,1,75,1],[76,0,77,0],[34,0,35,0],[34,1,35,1],[36,0,37,0],[36,1,37,1],[38,0,39,0],[38,1,39,1],[52,0,53,0],[52,1,53,1],[54,0,55,0],[54,1,55,1],[46,0,47,0],[46,1,47,1],[48,0,49,0],[48,1,49,1],[50,0,51,0],[50,1,51,1],[40,0,41,0],[40,1,41,1],[42,0,43,0],[42,1,43,1],[44,0,45,0],[44,1,45,1],[56,0,57,0],[56,1,57,1],[64,0,65,0],[64,1,65,1],[66,0,67,0],[66,1,67,1],[68,0,69,0],[68,1,69,1],[58,0,59,0],[58,1,59,1],[60,0,61,0],[60,1,61,1],[62,0,63,0],[62,1,63,1],[18,0,19,0],[18,1,19,1],[16,1,17,1],[214,0,215,1],[213,0,213,2],[20,0,21,0],[20,1,21,1],[22,0,23,0],[22,1,23,1],[24,0,25,0],[24,1,25,1],[26,0,27,0],[26,1,27,1],[28,0,29,0],[28,1,29,1],[30,0,31,0],[30,1,31,1],[32,0,33,0],[32,1,33,1],[117,0,118,0],[111,0,112,0],[104,0,105,1],[111,1,112,1],[113,1,114,1],[212,0,212,6],[10,0,11,0],[12,0,13,0],[14,0,15,0],[4,1,5,1],[4,0,5,0],[121,0,122,0],[209,0,210,1],[123,0,124,0],[113,0,114,0],[121,1,122,1],[123,1,124,1],[117,1,118,1],[6,0,7,0],[8,0,9,0],[6,1,7,1],[8,1,9,1],[10,1,11,1],[12,1,13,1],[14,1,15,1],[16,0,17,0]]}
["INVOICE",null,null,null,null,null,null,null,null,null,null,null,null,"SANDBOX AREA (highlighted in light red)- For rough work associated with the print area to the left.  Rough work may include, notes, calculations, derivations, etc."]
["SUBRECIPIENTS AND VENDORS"]
["Subrecipients Summary"]
["Budget Worksheet Reference ID","Subrecipient Name","Funding Category","Subrecipient Agreement  Budget","Subrecipient  Request This Period","Subrecipient Cumulative Expenses Billed to Date","Subrecipient  Balance","Subrecipient Exempt from Retention?","Billed CEC\nExpenses\nwithout Retention"]
["S-1","M&M, Inc.","CEC",50000,9257.26,15636.523999999999,{"$f":"ROUND(D5,2)-ROUND(F5,2)","v":34363.479999999996},"No",{"$f":"IF(H5=\"Yes\",ROUND(E5,2),0)","v":0}]
[null,null,"Match",30000,5137.6099999999997,7717.5499999999993,{"$f":"ROUND(D6,2)-ROUND(F6,2)","v":22282.45}]
["S-1","ABC National Lab","CEC",50000,11635.71,17103.939999999999,32896.06,"Yes",{"$f":"IF(H7=\"Yes\",ROUND(E7,2),0)","v":11635.71}]
[null,null,"Match",40000,8267.43,9952.2999999999993,30047.7]
[null,"Subrecipient 3","CEC",0,0,0,0,"Select Yes or No",{"$f":"IF(H9=\"Yes\",ROUND(E9,2),0)","v":0}]
[null,null,"Match",0,0,0,0]
[null,"Subrecipient 4","CEC",0,0,0,0,"Select Yes or No",{"$f":"IF(H11=\"Yes\",ROUND(E11,2),0)","v":0}]
[null,null,"Match",0,0,0,0]
[null,"Subrecipient 5","CEC",0,0,0,0,"Select Yes or No",{"$f":"IF(H13=\"Yes\",ROUND(E13,2),0)","v":0}]
[null,null,"Match",0,0,0,0]
[null,"Subrecipient 6","CEC",0,0,0,0,"Select Yes or No",{"$f":"IF(H15=\"Yes\",ROUND(E15,2),0)","v":0}]
[null,null,"Match",0,0,0,0]
[null,"Subrecipient 7","CEC",0,0,0,0,"Select Yes or No",{"$f":"IF(H17=\"Yes\",ROUND(E17,2),0)","v":0}]
[null,null,"Match",0,0,0,0]
[null,"Subrecipient 8","CEC",0,0,0,0,"Select Yes or No",{"$f":"IF(H19=\"Yes\",ROUND(E19,2),0)","v":0}]
[null,null,"Match",0,0,0,0]
[null,"Subrecipient 9","CEC",0,0,0,{"$f":"ROUND(D21,2)-ROUND(F21,2)","v":0},"Select Yes or No",{"$f":"IF(H21=\"Yes\",ROUND(E21,2),0)","v":0}]
[null,null,"Match",0,0,0,0]
[null,"Subrecipient 10","CEC",0,0,0,0,"Select Yes or No",{"$f":"IF(H23=\"Yes\",ROUND(E23,2),0)","v":0}]
[null,null,"Match",0,0,0,0]
[null,"Subrecipient 11","CEC",0,0,0,0,"Select Yes or No",{"$f":"IF(H25=\"Yes\",ROUND(E25,2),0)","v":0}]
[null,null,"Match",0,0,0,0]
[null,"Subrecipient 12","CEC",0,0,0,0,"Select Yes or No",{"$f":"IF(H27=\"Yes\",ROUND(E27,2),0)","v":0}]
[null,null,"Match",0,0,0,0]
[null,"Subrecipient 13","CEC",0,0,0,0,"Select Yes or No",{"$f":"IF(H29=\"Yes\",ROUND(E29,2),0)","v":0}]
[null,null,"Match",0,0,0,0]
{"$rows_left_out":187}
{"sheet":"Lists","index":6,"n_rows":20,"n_cols":1,"rows_kept":20,"cut":false,"hidden":true,"merged":[]}
["Retention Method Selection"]
["Select a Retention Method"]
["Retention will be withheld at the end of the agreement (minus exempt subrecipients)"]
["Retention will be withheld from each invoice (minus exempt subrecipients)"]
["Retention is NOT required to be withheld for this agreement"]
[]
["End of Agreement Retention Method Situation"]
["If Applicable: \nSelect End of Agreement Retention Method Situation"]
["90.00%, or less, of CEC funds spent to date (minus exempt subrecipients), including this invoice"]
["With this invoice, percentage of CEC funds spent (minus exempt subrecipients) will transition from less than to greater than 90.00% [manually enter required retention amount below]"]
["More than 90.00% of CEC funds spent to date (minus exempt subrecipients), including this entire invoice"]
[]
["Invoice Selection"]
["Select Yes or No"]
["Yes"]
["No"]
["Subrecipient Exempt from Retention Selection"]
["Select Yes or No"]
["Yes"]
["No"]