{"text_format":"1","workbook":"xlsx","n_sheets":10,"sheets":["Instructions","Category Budget","Direct Labor","Fringe Benefits","Travel","Equipment","Materials & Misc.","Subrecipients & Vendors","Indirect Costs & Profit","Lists"],"not_rendered":{"charts":0,"images":0,"macros":0,"external_links":0,"defined_names":17,"comments":0,"pivot_tables":0},"unopened":[],"bounds":{"document_bytes":16777216,"sheet_cells":100000,"rows_first":2000,"rows_last":500,"rows_between":2000,"halvings":0,"cell_chars":16384,"cell_head_chars":4096},"cells_cut":0,"cells_raw":0,"read":"whole","date_system":"1900"}

{"sheet":"Instructions","index":0,"n_rows":36,"n_cols":10,"rows_kept":36,"cut":false,"hidden":false,"merged":[[0,2,0,4],[33,0,33,4],[1,0,1,4],[2,0,2,4],[3,0,3,4],[6,0,6,4],[7,0,7,4],[26,0,26,4],[27,0,27,4],[9,0,9,4],[10,0,10,4],[11,0,11,4],[12,0,12,4],[13,0,13,4],[14,0,14,4],[28,0,28,4],[34,0,34,4],[35,0,35,4],[19,0,19,4],[20,0,20,4],[21,0,21,4],[22,0,22,4],[23,0,23,4],[24,0,24,4],[25,0,25,4],[29,0,29,4],[30,0,30,4],[31,0,31,4],[32,0,32,4],[4,0,4,4],[15,0,15,4],[16,0,16,4],[17,0,17,4],[18,0,18,4],[8,0,8,4],[5,0,5,4]]}
[{"$f":"'Category Budget'!$A$1","v":"Template Version 08/23/2021"},null,{"$f":"CONCATENATE('Category Budget'!$B$1,\" \",'Category Budget'!$D$1)","v":" "},null,null,null,null,null,null,"SANDBOX AREA (highlighted in light red)- For rough work associated with the print area to the left.  Rough work may include, notes, calculations, derivations, etc."]
["Workbook Instructions"]
["Input Data:  Enter information as required in all cells highlighted in Blue."]
["Restricted Editing:  All cells not highlighted in Blue are locked from editing.  Locked cells include:  cells with formulas highlighted in Gray or Light Yellow, cells with no color fill (white), etc."]
["For the Agreement Budget Template ONLY:  Colored Tabs:\nThe \"Equipment\" and \"Subrecipients & Vendors\" budget category tabs are colored ORANGE to indicate that line item details can be entered for these budget categories.  The other budget category tabs (Direct Labor, Fringe Benefits, Travel, Materials & Misc., and Indirect Costs & Profit) only contain category totals."]
["Regarding Confidential Information:  Avoid disclosing trade secrets and confidential information on any agreement document, since these documents are publicly accessible."]
["Rules for decimal places on values:"]
["·         Budget and Invoice values:"]
["o   Rounding of any values, as described below, should be performed using standard rounding practices."]
["o   For all currency rates (e.g., Direct Labor, and Unit Cost):  Round to the cent ($0.01)."]
["o   For all percentage rates (e.g., Fringe Benefits, Indirect Cost, and Profit):  Round to a maximum of two decimal places of a percent (e.g., 25.12%).  You can round to less if desired, such as one decimal place (e.g., 25.1%), or zero decimal places (e.g., 25%)."]
["o   For all quantity values (e.g., # of hours, # of months, and # of units):  Round to a maximum of two decimal places (e.g., 50.12).  You can round to less if desired, such as one decimal place (e.g., 50.1), or zero decimal places (e.g., 50)."]
["·         Budget values:"]
["o   For entered and totaled (via calculation) CEC and Match share budget values:  Round to the dollar ($1)."]
["o   For all calculated currency values (e.g., rate x hours, rate x months, base amount, and rate x base amount):  Round to the dollar ($1)."]
["·         Invoice values:"]
["o   For entered and totaled (via calculation) CEC and Match share expense invoice values:  Round to the cent ($0.01)."]
["o   For all calculated currency values (e.g., rate x hours, rate x months, base amount, and rate x base amount):  Round to the cent ($0.01)."]
["o   SPECIAL CIRCUMSTANCE for calculated currency values:  ONLY if a calculated value (e.g., rate x hours = actual labor expense) does NOT equal the actual expense, because of the decimal place rules provided for rates and quantity values listed above, it is acceptable to use as many decimal places as necessary for rates and quantity values listed above to ensure that the calculated value DOES equal the actual expense."]
["Invoice Supporting Documentation Requirements, per Budget Category:"]
["The list below contains the supporting documentation that is required to be submitted with an invoice.  IMPORTANT:  The recipient and subrecipients must still retain supporting documentation for all project expenses in case of an audit (“supporting documents” are also known as “backup documents”)."]
["o   Direct Labor – No supporting documentation required with invoice."]
["o   Fringe Benefits – No supporting documentation required with invoice."]
["o   Travel - Receipts are required only for: Lodging, Airfare, Rental car (including gasoline expenses), Bus/train."]
["o   Equipment – 1) For equipment that is equal to or greater than $100,000 per line item total (including both CEC and Match Funds), documentation showing the payment terms must be provided to the CAM. 2)  CAM must be able to verify equipment purchases for: 1) equipment with a per line item incurred cost of $500,000 or greater; or 2) a single equipment vendor with $500,000 or more in equipment incurred costs. See Invoice Review Checklist for methods to verify."]
["o   Materials & Miscellaneous – Receipt required for any line item total that is $5,000 or more."]
["o   Subrecipients & Vendors – Major subrecipients (Budget of 100k or more) follow the same budget requirements as the Recipient when submitting an invoice. For Minor subrecipients and Vendors, subrecipient or vendor invoice required."]
["o   Indirect Costs & Profit – No supporting documentation required with invoice."]
["Adding Rows:  If additional rows are needed within a section, unhide the hidden rows (i.e., select the row directly above and below the hidden rows, then right-click the selection and select “Unhide”).  Hide any unused rows.  DO NOT USE THE LAST TWO ROWS THAT ARE MARKED “CEC USE ONLY”.  If all but the last 2 rows are used, and more rows are required, please contact the ECAMS Support team (ECAMS.Support@energy.ca.gov)."]
["FOR ECAMS SUPPORT TEAM ONLY:  ADDING ROWS:\nTo add additional rows and maintain the formulas within the totals, (1) unprotect the sheet, (2) copy the second to the last row in the section, (3) insert the copied row just above the last row, (4) repeat steps 2 - 3 as required, (5) correct formatting and REFERENCE IDs as required, (6) delete “CEC USE ONLY” from all but the last two rows in the section, and (7) re-protect the sheet."]
["Updating Modification Date on Budgets:\nAfter making modifications to a budget file, update the modification date as described below."]
["o   Budget Worksheet file – Update the \"Date of Last Budget Worksheet Modification\" to the date the modifications were completed.  Update the \"Date of Last Budget Worksheet Modification\" in cell D1 of the \"Category Budget\" tab–this updates the rest of the tabs in the template."]
["o   Agreement Budget file – Update the \"Date of Last Approved Agreement Budget Modification\" to the date the modifications were approved.  Update the \"Date of Last Approved Agreement Budget Modification\" in cell D1 of the \"Category Budget\" tab–this updates the rest of the tabs in the template."]
["FOR ECAMS SUPPORT TEAM ONLY:  UPDATING \"TEMPLATE VERSION\" DATE:\nAfter making modifications to a budget or invoice template, update the \"Template Version\" date to the date the modifications were completed.  For the budget templates, update the \"Template Version\" date in cell A1 of the \"Category Budget\" tab–this updates the rest of the tabs in the template.  For the invoice templates, update the \"Template Version\" date in cell A1 of the \"Invoice Payment Cover Sheet\" tab–this updates the rest of the tabs in the template."]
["ECAMS Support:  For support on how to complete this template, please visit the ECAMS Resources web page.  The link to this web page is provided in the cell below:"]
["https://www.energy.ca.gov/funding-opportunities/funding-resources/ecams-resources"]

{"sheet":"Category Budget","index":1,"n_rows":22,"n_cols":16,"rows_kept":22,"cut":false,"hidden":false,"merged":[[2,9,2,15],[3,9,6,11],[3,13,6,15],[0,1,0,2],[5,0,5,3],[6,0,6,3],[3,1,3,3],[1,0,1,3],[4,1,4,3],[2,0,2,3]]}
["Template Version 08/23/2021",null,null,null,null,null,null,null,"SANDBOX AREA (highlighted in light red)- For rough work associated with the print area to the left.  Rough work may include, notes, calculations, derivations, etc."]
["PROPOSAL BUDGET"]
["Category Budget",null,null,null,null,null,null,null,null,"\"Category Budget\" value check, below, to use to ensure that values match between budget files when converting or updating budget files."]
["Agreement Number","GFO-22-607",null,null,null,null,null,null,null,"Paste values in Blue cells below from \"Category Budget\" tab of the budget file that you want to compare against (such as another Budget Worksheet file, an Agreement Budget file, or an old budget file that you want to convert to the new templates).",null,null,null,"The formulas in the cells below compare the \"Category Budget\" values of the other budget file with those of this budget file.  Values that match from both budget files will receive a \"Pass\" result.  Values that DO NOT match from both budget files will receive a \"Fail\" result, which will become conditionally formatted to red."]
["Name of Organization","Organization Name"]
["Select Recipient or Subrecipient"]
["Select your company's California Business Certifications"]
["Cost Category","CEC Share","Match Share","Total",null,null,null,null,null,"CEC Share","Match Share","Total",null,"CEC Share","Match Share","Total"]
["Direct Labor",{"$f":"'Direct Labor'!E215","v":0},{"$f":"'Direct Labor'!F215","v":0},{"$f":"'Direct Labor'!G215","v":0},null,null,null,null,null,0,0,0,null,{"$f":"IF(B9=J9,\"Pass\",\"Fail\")","v":"Pass"},{"$f":"IF(C9=K9,\"Pass\",\"Fail\")","v":"Pass"},{"$f":"IF(D9=L9,\"Pass\",\"Fail\")","v":"Pass"}]
["Fringe Benefits",{"$f":"'Fringe Benefits'!E106","v":0},{"$f":"'Fringe Benefits'!F106","v":0},{"$f":"'Fringe Benefits'!G106","v":0},null,null,null,null,null,0,0,0,null,{"$f":"IF(B10=J10,\"Pass\",\"Fail\")","v":"Pass"},"Pass","Pass"]
["Total Labor",{"$f":"SUM(B9:B10)","v":0},{"$f":"SUM(C9:C10)","v":0},{"$f":"SUM(D9:D10)","v":0},null,null,null,null,null,0,0,0,null,"Pass","Pass","Pass"]
["Travel",{"$f":"Travel!G56","v":0},{"$f":"Travel!H56","v":0},{"$f":"Travel!I56","v":0},null,null,null,null,null,0,0,0,null,"Pass","Pass","Pass"]
["Equipment",{"$f":"Equipment!I208","v":0},{"$f":"Equipment!J208","v":0},{"$f":"Equipment!K208","v":0},null,null,null,null,null,0,0,0,null,"Pass","Pass","Pass"]
["Materials/Miscellaneous",{"$f":"'Materials & Misc.'!I208","v":0},{"$f":"'Materials & Misc.'!J208","v":0},{"$f":"'Materials & Misc.'!K208","v":0},null,null,null,null,null,0,0,0,null,"Pass","Pass","Pass"]
["Subrecipients/Vendors",{"$f":"'Subrecipients & Vendors'!G115","v":0},{"$f":"'Subrecipients & Vendors'!H115","v":0},{"$f":"'Subrecipients & Vendors'!I115","v":0},null,null,null,null,null,0,0,0,null,"Pass","Pass","Pass"]
["Total Other Direct Costs",{"$f":"SUM(B12:B15)","v":0},{"$f":"SUM(C12:C15)","v":0},{"$f":"SUM(D12:D15)","v":0},null,null,null,null,null,0,0,0,null,"Pass","Pass","Pass"]
["Indirect Costs",{"$f":"'Indirect Costs & Profit'!J148","v":0},{"$f":"'Indirect Costs & Profit'!K148","v":0},{"$f":"'Indirect Costs & Profit'!L148","v":0},null,null,null,null,null,0,0,0,null,"Pass","Pass","Pass"]
["Profit \n(not allowed for grant recipients)",{"$f":"'Indirect Costs & Profit'!J159","v":0},{"$f":"'Indirect Costs & Profit'!K159","v":0},{"$f":"'Indirect Costs & Profit'!L159","v":0},null,null,null,null,null,0,0,0,null,"Pass","Pass","Pass"]
["Total Indirect and Profit",{"$f":"SUM(B17:B18)","v":0},{"$f":"SUM(C17:C18)","v":0},{"$f":"SUM(D17:D18)","v":0},null,null,null,null,null,0,0,0,null,"Pass","Pass","Pass"]
["Grand Totals",{"$f":"B11+B16+B19","v":0},{"$f":"C11+C16+C19","v":0},{"$f":"D11+D16+D19","v":0},null,null,null,null,null,0,0,0,null,"Pass","Pass",{"$f":"IF(D20=L20,\"Pass\",\"Fail\")","v":"Pass"}]
["Total CEC Reimbursable Funds Spent in California or Paid to California-Based Entities \n(if applicable)",0,null,null,null,null,null,null,null,0,null,null,null,{"$f":"IF(B21=J21,\"Pass\",\"Fail\")","v":"Pass"}]
["Percentage of CEC Reimbursable Funds Spent in California or Paid to California-Based Entities",{"$f":"IF(B21=0,\"\",B21/B20)","v":""},null,null,null,null,null,null,null,0,null,null,null,{"$f":"IF(B22=J22,\"Pass\",\"Fail\")","v":"Fail"}]

{"sheet":"Direct Labor","index":2,"n_rows":215,"n_cols":12,"rows_kept":215,"cut":false,"hidden":false,"merged":[[214,0,214,3],[210,0,210,3],[213,0,213,3],[212,0,212,6],[0,5,0,6],[108,0,108,6],[0,0,0,1],[106,0,106,3],[1,0,1,6],[2,0,2,6],[3,0,3,6],[4,0,4,6]]}
[{"$f":"'Category Budget'!$A$1","v":"Template Version 08/23/2021"},null,null,null,null,null,null,null,null,null,null,"SANDBOX AREA (highlighted in light red)- For rough work associated with the print area to the left.  Rough work may include, notes, calculations, derivations, etc."]
["PROPOSAL BUDGET"]
["Direct Labor (Unloaded)"]
[{"$f":"CONCATENATE('Category Budget'!$B$4,\":  \",'Category Budget'!$B$5)","v":"GFO-22-607:  Organization Name"}]
["Hourly Rates"]
["Job Classification","Highest Estimated Labor Rate \n($ per hour)","# of Hours","Rate x Hours","CEC\nShare","Match\nShare","Total"]
[null,0,0,{"$f":"ROUND(B7*C7,0)","v":0},0,0,{"$f":"SUM(ROUND(E7:F7,0))","v":0}]
[null,0,0,{"$f":"ROUND(B8*C8,0)","v":0},0,0,{"$f":"SUM(ROUND(E8:F8,0))","v":0}]
[null,0,0,0,0,0,{"$f":"SUM(ROUND(E9:F9,0))","v":0}]
[null,0,0,0,0,0,{"$f":"SUM(ROUND(E10:F10,0))","v":0}]
[null,0,0,0,0,0,{"$f":"SUM(ROUND(E11:F11,0))","v":0}]
[null,0,0,0,0,0,{"$f":"SUM(ROUND(E12:F12,0))","v":0}]
[null,0,0,0,0,0,{"$f":"SUM(ROUND(E13:F13,0))","v":0}]
[null,0,0,0,0,0,{"$f":"SUM(ROUND(E14:F14,0))","v":0}]
[null,0,0,0,0,0,{"$f":"SUM(ROUND(E15:F15,0))","v":0}]
[null,0,0,0,0,0,{"$f":"SUM(ROUND(E16:F16,0))","v":0}]
[null,0,0,0,0,0,{"$f":"SUM(ROUND(E17:F17,0))","v":0}]
[null,0,0,0,0,0,{"$f":"SUM(ROUND(E18:F18,0))","v":0}]
[null,0,0,0,0,0,{"$f":"SUM(ROUND(E19:F19,0))","v":0}]
[null,0,0,0,0,0,{"$f":"SUM(ROUND(E20:F20,0))","v":0}]
[null,0,0,0,0,0,{"$f":"SUM(ROUND(E21:F21,0))","v":0}]
[null,0,0,0,0,0,{"$f":"SUM(ROUND(E22:F22,0))","v":0}]
[null,0,0,0,0,0,{"$f":"SUM(ROUND(E23:F23,0))","v":0}]
[null,0,0,0,0,0,{"$f":"SUM(ROUND(E24:F24,0))","v":0}]
[null,0,0,0,0,0,{"$f":"SUM(ROUND(E25:F25,0))","v":0}]
[null,0,0,0,0,0,{"$f":"SUM(ROUND(E26:F26,0))","v":0}]
[null,0,0,0,0,0,{"$f":"SUM(ROUND(E27:F27,0))","v":0}]
[null,0,0,0,0,0,{"$f":"SUM(ROUND(E28:F28,0))","v":0}]
[null,0,0,{"$f":"ROUND(B29*C29,0)","v":0},0,0,{"$f":"SUM(ROUND(E29:F29,0))","v":0}]
[null,0,0,0,0,0,{"$f":"SUM(ROUND(E30:F30,0))","v":0}]
[null,0,0,0,0,0,{"$f":"SUM(ROUND(E31:F31,0))","v":0}]
[null,0,0,0,0,0,{"$f":"SUM(ROUND(E32:F32,0))","v":0}]
[null,0,0,0,0,0,{"$f":"SUM(ROUND(E33:F33,0))","v":0}]
[null,0,0,0,0,0,{"$f":"SUM(ROUND(E34:F34,0))","v":0}]
[null,0,0,0,0,0,{"$f":"SUM(ROUND(E35:F35,0))","v":0}]
[null,0,0,0,0,0,{"$f":"SUM(ROUND(E36:F36,0))","v":0}]
[null,0,0,0,0,0,{"$f":"SUM(ROUND(E37:F37,0))","v":0}]
[null,0,0,0,0,0,{"$f":"SUM(ROUND(E38:F38,0))","v":0}]
[null,0,0,0,0,0,{"$f":"SUM(ROUND(E39:F39,0))","v":0}]
[null,0,0,0,0,0,{"$f":"SUM(ROUND(E40:F40,0))","v":0}]
[null,0,0,0,0,0,{"$f":"SUM(ROUND(E41:F41,0))","v":0}]
[null,0,0,0,0,0,{"$f":"SUM(ROUND(E42:F42,0))","v":0}]
[null,0,0,0,0,0,{"$f":"SUM(ROUND(E43:F43,0))","v":0}]
[null,0,0,0,0,0,{"$f":"SUM(ROUND(E44:F44,0))","v":0}]
[null,0,0,0,0,0,{"$f":"SUM(ROUND(E45:F45,0))","v":0}]
[null,0,0,0,0,0,{"$f":"SUM(ROUND(E46:F46,0))","v":0}]
[null,0,0,0,0,0,{"$f":"SUM(ROUND(E47:F47,0))","v":0}]
[null,0,0,0,0,0,{"$f":"SUM(ROUND(E48:F48,0))","v":0}]
[null,0,0,0,0,0,{"$f":"SUM(ROUND(E49:F49,0))","v":0}]
[null,0,0,0,0,0,{"$f":"SUM(ROUND(E50:F50,0))","v":0}]
[null,0,0,0,0,0,{"$f":"SUM(ROUND(E51:F51,0))","v":0}]
[null,0,0,0,0,0,{"$f":"SUM(ROUND(E52:F52,0))","v":0}]
[null,0,0,0,0,0,{"$f":"SUM(ROUND(E53:F53,0))","v":0}]
[null,0,0,0,0,0,{"$f":"SUM(ROUND(E54:F54,0))","v":0}]
[null,0,0,0,0,0,{"$f":"SUM(ROUND(E55:F55,0))","v":0}]
[null,0,0,0,0,0,{"$f":"SUM(ROUND(E56:F56,0))","v":0}]
[null,0,0,0,0,0,{"$f":"SUM(ROUND(E57:F57,0))","v":0}]
[null,0,0,{"$f":"ROUND(B58*C58,0)","v":0},0,0,{"$f":"SUM(ROUND(E58:F58,0))","v":0}]
[null,0,0,0,0,0,{"$f":"SUM(ROUND(E59:F59,0))","v":0}]
[null,0,0,0,0,0,{"$f":"SUM(ROUND(E60:F60,0))","v":0}]
[null,0,0,0,0,0,{"$f":"SUM(ROUND(E61:F61,0))","v":0}]
[null,0,0,0,0,0,{"$f":"SUM(ROUND(E62:F62,0))","v":0}]
[null,0,0,0,0,0,{"$f":"SUM(ROUND(E63:F63,0))","v":0}]
[null,0,0,0,0,0,{"$f":"SUM(ROUND(E64:F64,0))","v":0}]
[null,0,0,0,0,0,{"$f":"SUM(ROUND(E65:F65,0))","v":0}]
[null,0,0,0,0,0,{"$f":"SUM(ROUND(E66:F66,0))","v":0}]
[null,0,0,0,0,0,{"$f":"SUM(ROUND(E67:F67,0))","v":0}]
[null,0,0,0,0,0,{"$f":"SUM(ROUND(E68:F68,0))","v":0}]
[null,0,0,0,0,0,{"$f":"SUM(ROUND(E69:F69,0))","v":0}]
[null,0,0,0,0,0,{"$f":"SUM(ROUND(E70:F70,0))","v":0}]
[null,0,0,0,0,0,{"$f":"SUM(ROUND(E71:F71,0))","v":0}]
[null,0,0,0,0,0,{"$f":"SUM(ROUND(E72:F72,0))","v":0}]
[null,0,0,0,0,0,{"$f":"SUM(ROUND(E73:F73,0))","v":0}]
[null,0,0,{"$f":"ROUND(B74*C74,0)","v":0},0,0,{"$f":"SUM(ROUND(E74:F74,0))","v":0}]
[null,0,0,0,0,0,{"$f":"SUM(ROUND(E75:F75,0))","v":0}]
[null,0,0,0,0,0,{"$f":"SUM(ROUND(E76:F76,0))","v":0}]
[null,0,0,0,0,0,{"$f":"SUM(ROUND(E77:F77,0))","v":0}]
[null,0,0,0,0,0,{"$f":"SUM(ROUND(E78:F78,0))","v":0}]
[null,0,0,0,0,0,{"$f":"SUM(ROUND(E79:F79,0))","v":0}]
[null,0,0,0,0,0,{"$f":"SUM(ROUND(E80:F80,0))","v":0}]
[null,0,0,0,0,0,{"$f":"SUM(ROUND(E81:F81,0))","v":0}]
[null,0,0,0,0,0,{"$f":"SUM(ROUND(E82:F82,0))","v":0}]
[null,0,0,0,0,0,{"$f":"SUM(ROUND(E83:F83,0))","v":0}]
[null,0,0,0,0,0,{"$f":"SUM(ROUND(E84:F84,0))","v":0}]
[null,0,0,0,0,0,{"$f":"SUM(ROUND(E85:F85,0))","v":0}]
[null,0,0,0,0,0,{"$f":"SUM(ROUND(E86:F86,0))","v":0}]
[null,0,0,0,0,0,{"$f":"SUM(ROUND(E87:F87,0))","v":0}]
[null,0,0,0,0,0,{"$f":"SUM(ROUND(E88:F88,0))","v":0}]
[null,0,0,0,0,0,{"$f":"SUM(ROUND(E89:F89,0))","v":0}]
[null,0,0,0,0,0,{"$f":"SUM(ROUND(E90:F90,0))","v":0}]
[null,0,0,0,0,0,{"$f":"SUM(ROUND(E91:F91,0))","v":0}]
[null,0,0,0,0,0,{"$f":"SUM(ROUND(E92:F92,0))","v":0}]
[null,0,0,0,0,0,{"$f":"SUM(ROUND(E93:F93,0))","v":0}]
[null,0,0,{"$f":"ROUND(B94*C94,0)","v":0},0,0,{"$f":"SUM(ROUND(E94:F94,0))","v":0}]
[null,0,0,0,0,0,{"$f":"SUM(ROUND(E95:F95,0))","v":0}]
[null,0,0,0,0,0,{"$f":"SUM(ROUND(E96:F96,0))","v":0}]
[null,0,0,0,0,0,{"$f":"SUM(ROUND(E97:F97,0))","v":0}]
[null,0,0,{"$f":"ROUND(B98*C98,0)","v":0},0,0,{"$f":"SUM(ROUND(E98:F98,0))","v":0}]
[null,0,0,0,0,0,{"$f":"SUM(ROUND(E99:F99,0))","v":0}]
[null,0,0,0,0,0,{"$f":"SUM(ROUND(E100:F100,0))","v":0}]
[null,0,0,0,0,0,{"$f":"SUM(ROUND(E101:F101,0))","v":0}]
[null,0,0,0,0,0,{"$f":"SUM(ROUND(E102:F102,0))","v":0}]
[null,0,0,0,0,0,{"$f":"SUM(ROUND(E103:F103,0))","v":0}]
[null,0,0,{"$f":"ROUND(B104*C104,0)","v":0},0,0,{"$f":"SUM(ROUND(E104:F104,0))","v":0}]
["CEC USE ONLY",0,0,{"$f":"ROUND(B105*C105,0)","v":0},0,0,{"$f":"SUM(ROUND(E105:F105,0))","v":0}]
["CEC USE ONLY",0,0,0,0,0,{"$f":"SUM(ROUND(E106:F106,0))","v":0}]
["Hourly Direct Labor Totals",null,null,null,{"$f":"SUM(ROUND(E7:E106,0))","v":0},{"$f":"SUM(ROUND(F7:F106,0))","v":0},{"$f":"SUM(G7:G106)","v":0}]
[]
["Monthly Salary Rates"]
["Job Classification","Highest Estimated Labor Rate \n($ per month)","# of Months","Rate x Months","CEC\nShare","Match\nShare","Total"]
[null,0,0,{"$f":"ROUND(B111*C111,0)","v":0},0,0,{"$f":"SUM(ROUND(E111:F111,0))","v":0}]
[null,0,0,{"$f":"ROUND(B112*C112,0)","v":0},0,0,{"$f":"SUM(ROUND(E112:F112,0))","v":0}]
[null,0,0,0,0,0,{"$f":"SUM(ROUND(E113:F113,0))","v":0}]
[null,0,0,0,0,0,{"$f":"SUM(ROUND(E114:F114,0))","v":0}]
[null,0,0,0,0,0,{"$f":"SUM(ROUND(E115:F115,0))","v":0}]
[null,0,0,0,0,0,{"$f":"SUM(ROUND(E116:F116,0))","v":0}]
[null,0,0,0,0,0,{"$f":"SUM(ROUND(E117:F117,0))","v":0}]
[null,0,0,0,0,0,{"$f":"SUM(ROUND(E118:F118,0))","v":0}]
[null,0,0,0,0,0,{"$f":"SUM(ROUND(E119:F119,0))","v":0}]
[null,0,0,0,0,0,{"$f":"SUM(ROUND(E120:F120,0))","v":0}]
[null,0,0,0,0,0,{"$f":"SUM(ROUND(E121:F121,0))","v":0}]
[null,0,0,0,0,0,{"$f":"SUM(ROUND(E122:F122,0))","v":0}]
[null,0,0,0,0,0,{"$f":"SUM(ROUND(E123:F123,0))","v":0}]
[null,0,0,0,0,0,{"$f":"SUM(ROUND(E124:F124,0))","v":0}]
[null,0,0,0,0,0,{"$f":"SUM(ROUND(E125:F125,0))","v":0}]
[null,0,0,0,0,0,{"$f":"SUM(ROUND(E126:F126,0))","v":0}]
[null,0,0,0,0,0,{"$f":"SUM(ROUND(E127:F127,0))","v":0}]
[null,0,0,0,0,0,{"$f":"SUM(ROUND(E128:F128,0))","v":0}]
[null,0,0,0,0,0,{"$f":"SUM(ROUND(E129:F129,0))","v":0}]
[null,0,0,0,0,0,{"$f":"SUM(ROUND(E130:F130,0))","v":0}]
[null,0,0,0,0,0,{"$f":"SUM(ROUND(E131:F131,0))","v":0}]
[null,0,0,0,0,0,{"$f":"SUM(ROUND(E132:F132,0))","v":0}]
[null,0,0,0,0,0,{"$f":"SUM(ROUND(E133:F133,0))","v":0}]
[null,0,0,0,0,0,{"$f":"SUM(ROUND(E134:F134,0))","v":0}]
[null,0,0,0,0,0,{"$f":"SUM(ROUND(E135:F135,0))","v":0}]
[null,0,0,0,0,0,{"$f":"SUM(ROUND(E136:F136,0))","v":0}]
[null,0,0,0,0,0,{"$f":"SUM(ROUND(E137:F137,0))","v":0}]
[null,0,0,0,0,0,{"$f":"SUM(ROUND(E138:F138,0))","v":0}]
[null,0,0,0,0,0,{"$f":"SUM(ROUND(E139:F139,0))","v":0}]
[null,0,0,0,0,0,{"$f":"SUM(ROUND(E140:F140,0))","v":0}]
[null,0,0,0,0,0,{"$f":"SUM(ROUND(E141:F141,0))","v":0}]
[null,0,0,0,0,0,{"$f":"SUM(ROUND(E142:F142,0))","v":0}]
[null,0,0,0,0,0,{"$f":"SUM(ROUND(E143:F143,0))","v":0}]
[null,0,0,0,0,0,{"$f":"SUM(ROUND(E144:F144,0))","v":0}]
[null,0,0,0,0,0,{"$f":"SUM(ROUND(E145:F145,0))","v":0}]
[null,0,0,{"$f":"ROUND(B146*C146,0)","v":0},0,0,{"$f":"SUM(ROUND(E146:F146,0))","v":0}]
[null,0,0,0,0,0,{"$f":"SUM(ROUND(E147:F147,0))","v":0}]
[null,0,0,0,0,0,{"$f":"SUM(ROUND(E148:F148,0))","v":0}]
[null,0,0,0,0,0,{"$f":"SUM(ROUND(E149:F149,0))","v":0}]
[null,0,0,0,0,0,{"$f":"SUM(ROUND(E150:F150,0))","v":0}]
[null,0,0,0,0,0,{"$f":"SUM(ROUND(E151:F151,0))","v":0}]
[null,0,0,0,0,0,{"$f":"SUM(ROUND(E152:F152,0))","v":0}]
[null,0,0,0,0,0,{"$f":"SUM(ROUND(E153:F153,0))","v":0}]
[null,0,0,0,0,0,{"$f":"SUM(ROUND(E154:F154,0))","v":0}]
[null,0,0,0,0,0,{"$f":"SUM(ROUND(E155:F155,0))","v":0}]
[null,0,0,0,0,0,{"$f":"SUM(ROUND(E156:F156,0))","v":0}]
[null,0,0,0,0,0,{"$f":"SUM(ROUND(E157:F157,0))","v":0}]
[null,0,0,0,0,0,{"$f":"SUM(ROUND(E158:F158,0))","v":0}]
[null,0,0,0,0,0,{"$f":"SUM(ROUND(E159:F159,0))","v":0}]
[null,0,0,0,0,0,{"$f":"SUM(ROUND(E160:F160,0))","v":0}]
[null,0,0,0,0,0,{"$f":"SUM(ROUND(E161:F161,0))","v":0}]
[null,0,0,0,0,0,{"$f":"SUM(ROUND(E162:F162,0))","v":0}]
[null,0,0,0,0,0,{"$f":"SUM(ROUND(E163:F163,0))","v":0}]
[null,0,0,0,0,0,{"$f":"SUM(ROUND(E164:F164,0))","v":0}]
[null,0,0,0,0,0,{"$f":"SUM(ROUND(E165:F165,0))","v":0}]
[null,0,0,0,0,0,{"$f":"SUM(ROUND(E166:F166,0))","v":0}]
[null,0,0,0,0,0,{"$f":"SUM(ROUND(E167:F167,0))","v":0}]
[null,0,0,0,0,0,{"$f":"SUM(ROUND(E168:F168,0))","v":0}]
[null,0,0,0,0,0,{"$f":"SUM(ROUND(E169:F169,0))","v":0}]
[null,0,0,0,0,0,{"$f":"SUM(ROUND(E170:F170,0))","v":0}]
[null,0,0,0,0,0,{"$f":"SUM(ROUND(E171:F171,0))","v":0}]
[null,0,0,0,0,0,{"$f":"SUM(ROUND(E172:F172,0))","v":0}]
[null,0,0,0,0,0,{"$f":"SUM(ROUND(E173:F173,0))","v":0}]
[null,0,0,0,0,0,{"$f":"SUM(ROUND(E174:F174,0))","v":0}]
[null,0,0,0,0,0,{"$f":"SUM(ROUND(E175:F175,0))","v":0}]
[null,0,0,0,0,0,{"$f":"SUM(ROUND(E176:F176,0))","v":0}]
[null,0,0,0,0,0,{"$f":"SUM(ROUND(E177:F177,0))","v":0}]
[null,0,0,{"$f":"ROUND(B178*C178,0)","v":0},0,0,{"$f":"SUM(ROUND(E178:F178,0))","v":0}]
[null,0,0,0,0,0,{"$f":"SUM(ROUND(E179:F179,0))","v":0}]
[null,0,0,0,0,0,{"$f":"SUM(ROUND(E180:F180,0))","v":0}]
[null,0,0,0,0,0,{"$f":"SUM(ROUND(E181:F181,0))","v":0}]
[null,0,0,0,0,0,{"$f":"SUM(ROUND(E182:F182,0))","v":0}]
[null,0,0,0,0,0,{"$f":"SUM(ROUND(E183:F183,0))","v":0}]
[null,0,0,0,0,0,{"$f":"SUM(ROUND(E184:F184,0))","v":0}]
[null,0,0,0,0,0,{"$f":"SUM(ROUND(E185:F185,0))","v":0}]
[null,0,0,{"$f":"ROUND(B186*C186,0)","v":0},0,0,{"$f":"SUM(ROUND(E186:F186,0))","v":0}]
[null,0,0,0,0,0,{"$f":"SUM(ROUND(E187:F187,0))","v":0}]
[null,0,0,0,0,0,{"$f":"SUM(ROUND(E188:F188,0))","v":0}]
[null,0,0,0,0,0,{"$f":"SUM(ROUND(E189:F189,0))","v":0}]
[null,0,0,{"$f":"ROUND(B190*C190,0)","v":0},0,0,{"$f":"SUM(ROUND(E190:F190,0))","v":0}]
[null,0,0,0,0,0,{"$f":"SUM(ROUND(E191:F191,0))","v":0}]
[null,0,0,0,0,0,{"$f":"SUM(ROUND(E192:F192,0))","v":0}]
[null,0,0,0,0,0,{"$f":"SUM(ROUND(E193:F193,0))","v":0}]
[null,0,0,0,0,0,{"$f":"SUM(ROUND(E194:F194,0))","v":0}]
[null,0,0,0,0,0,{"$f":"SUM(ROUND(E195:F195,0))","v":0}]
[null,0,0,0,0,0,{"$f":"SUM(ROUND(E196:F196,0))","v":0}]
[null,0,0,0,0,0,{"$f":"SUM(ROUND(E197:F197,0))","v":0}]
[null,0,0,0,0,0,{"$f":"SUM(ROUND(E198:F198,0))","v":0}]
[null,0,0,0,0,0,{"$f":"SUM(ROUND(E199:F199,0))","v":0}]
[null,0,0,0,0,0,{"$f":"SUM(ROUND(E200:F200,0))","v":0}]
[null,0,0,0,0,0,{"$f":"SUM(ROUND(E201:F201,0))","v":0}]
[null,0,0,0,0,0,{"$f":"SUM(ROUND(E202:F202,0))","v":0}]
[null,0,0,0,0,0,{"$f":"SUM(ROUND(E203:F203,0))","v":0}]
[null,0,0,0,0,0,{"$f":"SUM(ROUND(E204:F204,0))","v":0}]
[null,0,0,0,0,0,{"$f":"SUM(ROUND(E205:F205,0))","v":0}]
[null,0,0,{"$f":"ROUND(B206*C206,0)","v":0},0,0,{"$f":"SUM(ROUND(E206:F206,0))","v":0}]
[null,0,0,0,0,0,{"$f":"SUM(ROUND(E207:F207,0))","v":0}]
[null,0,0,0,0,0,{"$f":"SUM(ROUND(E208:F208,0))","v":0}]
["CEC USE ONLY",0,0,0,0,0,{"$f":"SUM(ROUND(E209:F209,0))","v":0}]
["CEC USE ONLY",0,0,0,0,0,{"$f":"SUM(ROUND(E210:F210,0))","v":0}]
["Monthly Direct Labor Totals",null,null,null,{"$f":"SUM(ROUND(E111:E210,0))","v":0},{"$f":"SUM(ROUND(F111:F210,0))","v":0},{"$f":"SUM(G111:G210)","v":0}]
[]
["Direct Labor Grand Totals"]
[null,null,null,null,"CEC\nShare","Match\nShare","Total"]
["Grand Totals",null,null,null,{"$f":"E107+E211","v":0},{"$f":"F107+F211","v":0},{"$f":"G107+G211","v":0}]

{"sheet":"Fringe Benefits","index":3,"n_rows":106,"n_cols":12,"rows_kept":106,"cut":false,"hidden":false,"merged":[[0,5,0,6],[105,0,105,1],[1,0,1,6],[2,0,2,6],[3,0,3,6]]}
[{"$f":"'Category Budget'!$A$1","v":"Template Version 08/23/2021"},null,null,null,null,null,null,null,null,null,null,"SANDBOX AREA (highlighted in light red)- For rough work associated with the print area to the left.  Rough work may include, notes, calculations, derivations, etc."]
["PROPOSAL BUDGET"]
["Fringe Benefits"]
[{"$f":"CONCATENATE('Category Budget'!$B$4,\":  \",'Category Budget'!$B$5)","v":"GFO-22-607:  Organization Name"}]
["Job Classification","Highest Estimated Fringe Benefit Rate (%)","Direct Labor Costs ($)","Rate x Costs","CEC\nShare","Match\nShare","Total"]
[null,0,0,{"$f":"ROUND(B6*C6,0)","v":0},0,0,{"$f":"SUM(ROUND(E6:F6,0))","v":0}]
[null,0,0,{"$f":"ROUND(B7*C7,0)","v":0},0,0,{"$f":"SUM(ROUND(E7:F7,0))","v":0}]
[null,0,0,0,0,0,{"$f":"SUM(ROUND(E8:F8,0))","v":0}]
[null,0,0,0,0,0,{"$f":"SUM(ROUND(E9:F9,0))","v":0}]
[null,0,0,0,0,0,{"$f":"SUM(ROUND(E10:F10,0))","v":0}]
[null,0,0,0,0,0,{"$f":"SUM(ROUND(E11:F11,0))","v":0}]
[null,0,0,0,0,0,{"$f":"SUM(ROUND(E12:F12,0))","v":0}]
[null,0,0,0,0,0,{"$f":"SUM(ROUND(E13:F13,0))","v":0}]
[null,0,0,0,0,0,{"$f":"SUM(ROUND(E14:F14,0))","v":0}]
[null,0,0,0,0,0,{"$f":"SUM(ROUND(E15:F15,0))","v":0}]
[null,0,0,0,0,0,{"$f":"SUM(ROUND(E16:F16,0))","v":0}]
[null,0,0,0,0,0,{"$f":"SUM(ROUND(E17:F17,0))","v":0}]
[null,0,0,0,0,0,{"$f":"SUM(ROUND(E18:F18,0))","v":0}]
[null,0,0,0,0,0,{"$f":"SUM(ROUND(E19:F19,0))","v":0}]
[null,0,0,0,0,0,{"$f":"SUM(ROUND(E20:F20,0))","v":0}]
[null,0,0,0,0,0,{"$f":"SUM(ROUND(E21:F21,0))","v":0}]
[null,0,0,0,0,0,{"$f":"SUM(ROUND(E22:F22,0))","v":0}]
[null,0,0,0,0,0,{"$f":"SUM(ROUND(E23:F23,0))","v":0}]
[null,0,0,0,0,0,{"$f":"SUM(ROUND(E24:F24,0))","v":0}]
[null,0,0,0,0,0,{"$f":"SUM(ROUND(E25:F25,0))","v":0}]
[null,0,0,0,0,0,{"$f":"SUM(ROUND(E26:F26,0))","v":0}]
[null,0,0,0,0,0,{"$f":"SUM(ROUND(E27:F27,0))","v":0}]
[null,0,0,0,0,0,{"$f":"SUM(ROUND(E28:F28,0))","v":0}]
[null,0,0,0,0,0,{"$f":"SUM(ROUND(E29:F29,0))","v":0}]
[null,0,0,0,0,0,{"$f":"SUM(ROUND(E30:F30,0))","v":0}]
[null,0,0,0,0,0,{"$f":"SUM(ROUND(E31:F31,0))","v":0}]
[null,0,0,0,0,0,{"$f":"SUM(ROUND(E32:F32,0))","v":0}]
[null,0,0,0,0,0,{"$f":"SUM(ROUND(E33:F33,0))","v":0}]
[null,0,0,0,0,0,{"$f":"SUM(ROUND(E34:F34,0))","v":0}]
[null,0,0,0,0,0,{"$f":"SUM(ROUND(E35:F35,0))","v":0}]
[null,0,0,0,0,0,{"$f":"SUM(ROUND(E36:F36,0))","v":0}]
[null,0,0,0,0,0,{"$f":"SUM(ROUND(E37:F37,0))","v":0}]
[null,0,0,0,0,0,{"$f":"SUM(ROUND(E38:F38,0))","v":0}]
[null,0,0,0,0,0,{"$f":"SUM(ROUND(E39:F39,0))","v":0}]
[null,0,0,0,0,0,{"$f":"SUM(ROUND(E40:F40,0))","v":0}]
[null,0,0,0,0,0,{"$f":"SUM(ROUND(E41:F41,0))","v":0}]
[null,0,0,0,0,0,{"$f":"SUM(ROUND(E42:F42,0))","v":0}]
[null,0,0,0,0,0,{"$f":"SUM(ROUND(E43:F43,0))","v":0}]
[null,0,0,{"$f":"ROUND(B44*C44,0)","v":0},0,0,{"$f":"SUM(ROUND(E44:F44,0))","v":0}]
[null,0,0,0,0,0,{"$f":"SUM(ROUND(E45:F45,0))","v":0}]
[null,0,0,0,0,0,{"$f":"SUM(ROUND(E46:F46,0))","v":0}]
[null,0,0,0,0,0,{"$f":"SUM(ROUND(E47:F47,0))","v":0}]
[null,0,0,0,0,0,{"$f":"SUM(ROUND(E48:F48,0))","v":0}]
[null,0,0,0,0,0,{"$f":"SUM(ROUND(E49:F49,0))","v":0}]
[null,0,0,0,0,0,{"$f":"SUM(ROUND(E50:F50,0))","v":0}]
[null,0,0,0,0,0,{"$f":"SUM(ROUND(E51:F51,0))","v":0}]
[null,0,0,0,0,0,{"$f":"SUM(ROUND(E52:F52,0))","v":0}]
[null,0,0,0,0,0,{"$f":"SUM(ROUND(E53:F53,0))","v":0}]
[null,0,0,0,0,0,{"$f":"SUM(ROUND(E54:F54,0))","v":0}]
[null,0,0,0,0,0,{"$f":"SUM(ROUND(E55:F55,0))","v":0}]
[null,0,0,0,0,0,{"$f":"SUM(ROUND(E56:F56,0))","v":0}]
[null,0,0,0,0,0,{"$f":"SUM(ROUND(E57:F57,0))","v":0}]
[null,0,0,0,0,0,{"$f":"SUM(ROUND(E58:F58,0))","v":0}]
[null,0,0,0,0,0,{"$f":"SUM(ROUND(E59:F59,0))","v":0}]
[null,0,0,0,0,0,{"$f":"SUM(ROUND(E60:F60,0))","v":0}]
[null,0,0,0,0,0,{"$f":"SUM(ROUND(E61:F61,0))","v":0}]
[null,0,0,0,0,0,{"$f":"SUM(ROUND(E62:F62,0))","v":0}]
[null,0,0,0,0,0,{"$f":"SUM(ROUND(E63:F63,0))","v":0}]
[null,0,0,0,0,0,{"$f":"SUM(ROUND(E64:F64,0))","v":0}]
[null,0,0,0,0,0,{"$f":"SUM(ROUND(E65:F65,0))","v":0}]
[null,0,0,0,0,0,{"$f":"SUM(ROUND(E66:F66,0))","v":0}]
[null,0,0,0,0,0,{"$f":"SUM(ROUND(E67:F67,0))","v":0}]
[null,0,0,0,0,0,{"$f":"SUM(ROUND(E68:F68,0))","v":0}]
[null,0,0,0,0,0,{"$f":"SUM(ROUND(E69:F69,0))","v":0}]
[null,0,0,0,0,0,{"$f":"SUM(ROUND(E70:F70,0))","v":0}]
[null,0,0,0,0,0,{"$f":"SUM(ROUND(E71:F71,0))","v":0}]
[null,0,0,0,0,0,{"$f":"SUM(ROUND(E72:F72,0))","v":0}]
[null,0,0,0,0,0,{"$f":"SUM(ROUND(E73:F73,0))","v":0}]
[null,0,0,0,0,0,{"$f":"SUM(ROUND(E74:F74,0))","v":0}]
[null,0,0,0,0,0,{"$f":"SUM(ROUND(E75:F75,0))","v":0}]
[null,0,0,{"$f":"ROUND(B76*C76,0)","v":0},0,0,{"$f":"SUM(ROUND(E76:F76,0))","v":0}]
[null,0,0,0,0,0,{"$f":"SUM(ROUND(E77:F77,0))","v":0}]
[null,0,0,0,0,0,{"$f":"SUM(ROUND(E78:F78,0))","v":0}]
[null,0,0,0,0,0,{"$f":"SUM(ROUND(E79:F79,0))","v":0}]
[null,0,0,0,0,0,{"$f":"SUM(ROUND(E80:F80,0))","v":0}]
[null,0,0,0,0,0,{"$f":"SUM(ROUND(E81:F81,0))","v":0}]
[null,0,0,0,0,0,{"$f":"SUM(ROUND(E82:F82,0))","v":0}]
[null,0,0,0,0,0,{"$f":"SUM(ROUND(E83:F83,0))","v":0}]
[null,0,0,0,0,0,{"$f":"SUM(ROUND(E84:F84,0))","v":0}]
[null,0,0,0,0,0,{"$f":"SUM(ROUND(E85:F85,0))","v":0}]
[null,0,0,0,0,0,{"$f":"SUM(ROUND(E86:F86,0))","v":0}]
[null,0,0,0,0,0,{"$f":"SUM(ROUND(E87:F87,0))","v":0}]
[null,0,0,0,0,0,{"$f":"SUM(ROUND(E88:F88,0))","v":0}]
[null,0,0,0,0,0,{"$f":"SUM(ROUND(E89:F89,0))","v":0}]
[null,0,0,0,0,0,{"$f":"SUM(ROUND(E90:F90,0))","v":0}]
[null,0,0,0,0,0,{"$f":"SUM(ROUND(E91:F91,0))","v":0}]
[null,0,0,0,0,0,{"$f":"SUM(ROUND(E92:F92,0))","v":0}]
[null,0,0,0,0,0,{"$f":"SUM(ROUND(E93:F93,0))","v":0}]
[null,0,0,0,0,0,{"$f":"SUM(ROUND(E94:F94,0))","v":0}]
[null,0,0,0,0,0,{"$f":"SUM(ROUND(E95:F95,0))","v":0}]
[null,0,0,0,0,0,{"$f":"SUM(ROUND(E96:F96,0))","v":0}]
[null,0,0,0,0,0,{"$f":"SUM(ROUND(E97:F97,0))","v":0}]
[null,0,0,0,0,0,{"$f":"SUM(ROUND(E98:F98,0))","v":0}]
[null,0,0,0,0,0,{"$f":"SUM(ROUND(E99:F99,0))","v":0}]
[null,0,0,0,0,0,{"$f":"SUM(ROUND(E100:F100,0))","v":0}]
[null,0,0,0,0,0,{"$f":"SUM(ROUND(E101:F101,0))","v":0}]
[null,0,0,0,0,0,{"$f":"SUM(ROUND(E102:F102,0))","v":0}]
[null,0,0,0,0,0,{"$f":"SUM(ROUND(E103:F103,0))","v":0}]
["CEC USE ONLY",0,0,0,0,0,{"$f":"SUM(ROUND(E104:F104,0))","v":0}]
["CEC USE ONLY",0,0,0,0,0,{"$f":"SUM(ROUND(E105:F105,0))","v":0}]
["Grand Totals",null,{"$f":"SUM(ROUND(C6:C105,0))","v":0},{"$f":"SUM(ROUND(D6:D105,0))","v":0},{"$f":"SUM(ROUND(E6:E105,0))","v":0},{"$f":"SUM(ROUND(F6:F105,0))","v":0},{"$f":"SUM(G6:G105)","v":0}]

{"sheet":"Travel","index":4,"n_rows":56,"n_cols":14,"rows_kept":56,"cut":false,"hidden":false,"merged":[[0,0,0,2],[55,0,55,5],[1,0,1,8],[2,0,2,8],[3,0,3,8],[0,7,0,8]]}
[{"$f":"'Category Budget'!$A$1","v":"Template Version 08/23/2021"},null,null,null,null,null,null,null,null,null,null,null,null,"SANDBOX AREA (highlighted in light red)- For rough work associated with the print area to the left.  Rough work may include, notes, calculations, derivations, etc."]
["PROPOSAL BUDGET"]
["Travel"]
[{"$f":"CONCATENATE('Category Budget'!$B$4,\":  \",'Category Budget'!$B$5)","v":"GFO-22-607:  Organization Name"}]
["Reference ID","Task #","Traveler Name and Job  Classification","Dates of Travel (From/To)","Departure and Destination","Trip Purpose","CEC\nShare","Match\nShare","Total"]
["T-1",null,null,null,null,null,0,0,{"$f":"SUM(ROUND(G6:H6,0))","v":0}]
["T-2",null,null,null,null,null,0,0,{"$f":"SUM(ROUND(G7:H7,0))","v":0}]
["T-3",null,null,null,null,null,0,0,{"$f":"SUM(ROUND(G8:H8,0))","v":0}]
["T-4",null,null,null,null,null,0,0,{"$f":"SUM(ROUND(G9:H9,0))","v":0}]
["T-5",null,null,null,null,null,0,0,{"$f":"SUM(ROUND(G10:H10,0))","v":0}]
["T-6",null,null,null,null,null,0,0,{"$f":"SUM(ROUND(G11:H11,0))","v":0}]
["T-7",null,null,null,null,null,0,0,{"$f":"SUM(ROUND(G12:H12,0))","v":0}]
["T-8",null,null,null,null,null,0,0,{"$f":"SUM(ROUND(G13:H13,0))","v":0}]
["T-9",null,null,null,null,null,0,0,{"$f":"SUM(ROUND(G14:H14,0))","v":0}]
["T-10",null,null,null,null,null,0,0,{"$f":"SUM(ROUND(G15:H15,0))","v":0}]
["T-11",null,null,null,null,null,0,0,{"$f":"SUM(ROUND(G16:H16,0))","v":0}]
["T-12",null,null,null,null,null,0,0,{"$f":"SUM(ROUND(G17:H17,0))","v":0}]
["T-13",null,null,null,null,null,0,0,{"$f":"SUM(ROUND(G18:H18,0))","v":0}]
["T-14",null,null,null,null,null,0,0,{"$f":"SUM(ROUND(G19:H19,0))","v":0}]
["T-15",null,null,null,null,null,0,0,{"$f":"SUM(ROUND(G20:H20,0))","v":0}]
["T-16",null,null,null,null,null,0,0,{"$f":"SUM(ROUND(G21:H21,0))","v":0}]
["T-17",null,null,null,null,null,0,0,{"$f":"SUM(ROUND(G22:H22,0))","v":0}]
["T-18",null,null,null,null,null,0,0,{"$f":"SUM(ROUND(G23:H23,0))","v":0}]
["T-19",null,null,null,null,null,0,0,{"$f":"SUM(ROUND(G24:H24,0))","v":0}]
["T-20",null,null,null,null,null,0,0,{"$f":"SUM(ROUND(G25:H25,0))","v":0}]
["T-21",null,null,null,null,null,0,0,{"$f":"SUM(ROUND(G26:H26,0))","v":0}]
["T-22",null,null,null,null,null,0,0,{"$f":"SUM(ROUND(G27:H27,0))","v":0}]
["T-23",null,null,null,null,null,0,0,{"$f":"SUM(ROUND(G28:H28,0))","v":0}]
["T-24",null,null,null,null,null,0,0,{"$f":"SUM(ROUND(G29:H29,0))","v":0}]
["T-25",null,null,null,null,null,0,0,{"$f":"SUM(ROUND(G30:H30,0))","v":0}]
["T-26",null,null,null,null,null,0,0,{"$f":"SUM(ROUND(G31:H31,0))","v":0}]
["T-27",null,null,null,null,null,0,0,{"$f":"SUM(ROUND(G32:H32,0))","v":0}]
["T-28",null,null,null,null,null,0,0,{"$f":"SUM(ROUND(G33:H33,0))","v":0}]
["T-29",null,null,null,null,null,0,0,{"$f":"SUM(ROUND(G34:H34,0))","v":0}]
["T-30",null,null,null,null,null,0,0,{"$f":"SUM(ROUND(G35:H35,0))","v":0}]
["T-31",null,null,null,null,null,0,0,{"$f":"SUM(ROUND(G36:H36,0))","v":0}]
["T-32",null,null,null,null,null,0,0,{"$f":"SUM(ROUND(G37:H37,0))","v":0}]
["T-33",null,null,null,null,null,0,0,{"$f":"SUM(ROUND(G38:H38,0))","v":0}]
["T-34",null,null,null,null,null,0,0,{"$f":"SUM(ROUND(G39:H39,0))","v":0}]
["T-35",null,null,null,null,null,0,0,{"$f":"SUM(ROUND(G40:H40,0))","v":0}]
["T-36",null,null,null,null,null,0,0,{"$f":"SUM(ROUND(G41:H41,0))","v":0}]
["T-37",null,null,null,null,null,0,0,{"$f":"SUM(ROUND(G42:H42,0))","v":0}]
["T-38",null,null,null,null,null,0,0,{"$f":"SUM(ROUND(G43:H43,0))","v":0}]
["T-39",null,null,null,null,null,0,0,{"$f":"SUM(ROUND(G44:H44,0))","v":0}]
["T-40",null,null,null,null,null,0,0,{"$f":"SUM(ROUND(G45:H45,0))","v":0}]
["T-41",null,null,null,null,null,0,0,{"$f":"SUM(ROUND(G46:H46,0))","v":0}]
["T-42",null,null,null,null,null,0,0,{"$f":"SUM(ROUND(G47:H47,0))","v":0}]
["T-43",null,null,null,null,null,0,0,{"$f":"SUM(ROUND(G48:H48,0))","v":0}]
["T-44",null,null,null,null,null,0,0,{"$f":"SUM(ROUND(G49:H49,0))","v":0}]
["T-45",null,null,null,null,null,0,0,{"$f":"SUM(ROUND(G50:H50,0))","v":0}]
["T-46",null,null,null,null,null,0,0,{"$f":"SUM(ROUND(G51:H51,0))","v":0}]
["T-47",null,null,null,null,null,0,0,{"$f":"SUM(ROUND(G52:H52,0))","v":0}]
["T-48",null,null,null,null,null,0,0,{"$f":"SUM(ROUND(G53:H53,0))","v":0}]
["T-49",null,"CEC USE ONLY",null,null,null,0,0,{"$f":"SUM(ROUND(G54:H54,0))","v":0}]
["T-50",null,"CEC USE ONLY",null,null,null,0,0,{"$f":"SUM(ROUND(G55:H55,0))","v":0}]
["Grand Totals",null,null,null,null,null,{"$f":"SUM(ROUND(G6:G55,0))","v":0},{"$f":"SUM(ROUND(H6:H55,0))","v":0},{"$f":"SUM(I6:I55)","v":0}]

{"sheet":"Equipment","index":5,"n_rows":208,"n_cols":16,"rows_kept":208,"cut":false,"hidden":false,"merged":[[207,0,207,7],[3,0,3,10],[2,0,2,10],[0,9,0,10],[0,0,0,2],[1,0,1,10]]}
[{"$f":"'Category Budget'!$A$1","v":"Template Version 08/23/2021"},null,null,null,null,null,null,null,null,null,null,null,null,null,null,"SANDBOX AREA (highlighted in light red)- For rough work associated with the print area to the left.  Rough work may include, notes, calculations, derivations, etc."]
["PROPOSAL BUDGET"]
["Equipment"]
[{"$f":"CONCATENATE('Category Budget'!$B$4,\":  \",'Category Budget'!$B$5)","v":"GFO-22-607:  Organization Name"}]
["Reference ID","Task #","Seller of item(s)","Description","Purpose","# of Units","Unit Cost","Total:  \n# of Units x Unit Cost","CEC\nShare","Match\nShare","Total"]
["E-1",null,null,null,null,0,0,{"$f":"IF(OR(F6=\"Redacted\",G6=\"Redacted\"),\"Redacted\",IF(OR(T(F6)<>\"\",T(G6)<>\"\"),\"Varies\",ROUND(F6*G6,0)))","v":0},0,0,{"$f":"SUM(ROUND(I6:J6,0))","v":0}]
["E-2",null,null,null,null,0,0,{"$f":"IF(OR(F7=\"Redacted\",G7=\"Redacted\"),\"Redacted\",IF(OR(T(F7)<>\"\",T(G7)<>\"\"),\"Varies\",ROUND(F7*G7,0)))","v":0},0,0,{"$f":"SUM(ROUND(I7:J7,0))","v":0}]
["E-3",null,null,null,null,0,0,0,0,0,{"$f":"SUM(ROUND(I8:J8,0))","v":0}]
["E-4",null,null,null,null,0,0,{"$f":"IF(OR(F9=\"Redacted\",G9=\"Redacted\"),\"Redacted\",IF(OR(T(F9)<>\"\",T(G9)<>\"\"),\"Varies\",ROUND(F9*G9,0)))","v":0},0,0,{"$f":"SUM(ROUND(I9:J9,0))","v":0}]
["E-5",null,null,null,null,0,0,0,0,0,{"$f":"SUM(ROUND(I10:J10,0))","v":0}]
["E-6",null,null,null,null,0,0,0,0,0,{"$f":"SUM(ROUND(I11:J11,0))","v":0}]
["E-7",null,null,null,null,0,0,0,0,0,{"$f":"SUM(ROUND(I12:J12,0))","v":0}]
["E-8",null,null,null,null,0,0,0,0,0,{"$f":"SUM(ROUND(I13:J13,0))","v":0}]
["E-9",null,null,null,null,0,0,0,0,0,{"$f":"SUM(ROUND(I14:J14,0))","v":0}]
["E-10",null,null,null,null,0,0,0,0,0,{"$f":"SUM(ROUND(I15:J15,0))","v":0}]
["E-11",null,null,null,null,0,0,0,0,0,{"$f":"SUM(ROUND(I16:J16,0))","v":0}]
["E-12",null,null,null,null,0,0,0,0,0,{"$f":"SUM(ROUND(I17:J17,0))","v":0}]
["E-13",null,null,null,null,0,0,0,0,0,{"$f":"SUM(ROUND(I18:J18,0))","v":0}]
["E-14",null,null,null,null,0,0,0,0,0,{"$f":"SUM(ROUND(I19:J19,0))","v":0}]
["E-15",null,null,null,null,0,0,0,0,0,{"$f":"SUM(ROUND(I20:J20,0))","v":0}]
["E-16",null,null,null,null,0,0,0,0,0,{"$f":"SUM(ROUND(I21:J21,0))","v":0}]
["E-17",null,null,null,null,0,0,0,0,0,{"$f":"SUM(ROUND(I22:J22,0))","v":0}]
["E-18",null,null,null,null,0,0,0,0,0,{"$f":"SUM(ROUND(I23:J23,0))","v":0}]
["E-19",null,null,null,null,0,0,0,0,0,{"$f":"SUM(ROUND(I24:J24,0))","v":0}]
["E-20",null,null,null,null,0,0,0,0,0,{"$f":"SUM(ROUND(I25:J25,0))","v":0}]
["E-21",null,null,null,null,0,0,0,0,0,{"$f":"SUM(ROUND(I26:J26,0))","v":0}]
["E-22",null,null,null,null,0,0,0,0,0,{"$f":"SUM(ROUND(I27:J27,0))","v":0}]
["E-23",null,null,null,null,0,0,0,0,0,{"$f":"SUM(ROUND(I28:J28,0))","v":0}]
["E-24",null,null,null,null,0,0,0,0,0,{"$f":"SUM(ROUND(I29:J29,0))","v":0}]
["E-25",null,null,null,null,0,0,0,0,0,{"$f":"SUM(ROUND(I30:J30,0))","v":0}]
["E-26",null,null,null,null,0,0,0,0,0,{"$f":"SUM(ROUND(I31:J31,0))","v":0}]
["E-27",null,null,null,null,0,0,0,0,0,{"$f":"SUM(ROUND(I32:J32,0))","v":0}]
["E-28",null,null,null,null,0,0,0,0,0,{"$f":"SUM(ROUND(I33:J33,0))","v":0}]
["E-29",null,null,null,null,0,0,0,0,0,{"$f":"SUM(ROUND(I34:J34,0))","v":0}]
["E-30",null,null,null,null,0,0,0,0,0,{"$f":"SUM(ROUND(I35:J35,0))","v":0}]
["E-31",null,null,null,null,0,0,0,0,0,{"$f":"SUM(ROUND(I36:J36,0))","v":0}]
["E-32",null,null,null,null,0,0,0,0,0,{"$f":"SUM(ROUND(I37:J37,0))","v":0}]
["E-33",null,null,null,null,0,0,0,0,0,{"$f":"SUM(ROUND(I38:J38,0))","v":0}]
["E-34",null,null,null,null,0,0,0,0,0,{"$f":"SUM(ROUND(I39:J39,0))","v":0}]
["E-35",null,null,null,null,0,0,0,0,0,{"$f":"SUM(ROUND(I40:J40,0))","v":0}]
["E-36",null,null,null,null,0,0,0,0,0,{"$f":"SUM(ROUND(I41:J41,0))","v":0}]
["E-37",null,null,null,null,0,0,0,0,0,{"$f":"SUM(ROUND(I42:J42,0))","v":0}]
["E-38",null,null,null,null,0,0,0,0,0,{"$f":"SUM(ROUND(I43:J43,0))","v":0}]
["E-39",null,null,null,null,0,0,0,0,0,{"$f":"SUM(ROUND(I44:J44,0))","v":0}]
["E-40",null,null,null,null,0,0,0,0,0,{"$f":"SUM(ROUND(I45:J45,0))","v":0}]
["E-41",null,null,null,null,0,0,0,0,0,{"$f":"SUM(ROUND(I46:J46,0))","v":0}]
["E-42",null,null,null,null,0,0,0,0,0,{"$f":"SUM(ROUND(I47:J47,0))","v":0}]
["E-43",null,null,null,null,0,0,0,0,0,{"$f":"SUM(ROUND(I48:J48,0))","v":0}]
["E-44",null,null,null,null,0,0,0,0,0,{"$f":"SUM(ROUND(I49:J49,0))","v":0}]
["E-45",null,null,null,null,0,0,0,0,0,{"$f":"SUM(ROUND(I50:J50,0))","v":0}]
["E-46",null,null,null,null,0,0,0,0,0,{"$f":"SUM(ROUND(I51:J51,0))","v":0}]
["E-47",null,null,null,null,0,0,0,0,0,{"$f":"SUM(ROUND(I52:J52,0))","v":0}]
["E-48",null,null,null,null,0,0,0,0,0,{"$f":"SUM(ROUND(I53:J53,0))","v":0}]
["E-49",null,null,null,null,0,0,0,0,0,{"$f":"SUM(ROUND(I54:J54,0))","v":0}]
["E-50",null,null,null,null,0,0,0,0,0,{"$f":"SUM(ROUND(I55:J55,0))","v":0}]
["E-51",null,null,null,null,0,0,0,0,0,{"$f":"SUM(ROUND(I56:J56,0))","v":0}]
["E-52",null,null,null,null,0,0,0,0,0,{"$f":"SUM(ROUND(I57:J57,0))","v":0}]
["E-53",null,null,null,null,0,0,0,0,0,{"$f":"SUM(ROUND(I58:J58,0))","v":0}]
["E-54",null,null,null,null,0,0,0,0,0,{"$f":"SUM(ROUND(I59:J59,0))","v":0}]
["E-55",null,null,null,null,0,0,0,0,0,{"$f":"SUM(ROUND(I60:J60,0))","v":0}]
["E-56",null,null,null,null,0,0,0,0,0,{"$f":"SUM(ROUND(I61:J61,0))","v":0}]
["E-57",null,null,null,null,0,0,0,0,0,{"$f":"SUM(ROUND(I62:J62,0))","v":0}]
["E-58",null,null,null,null,0,0,0,0,0,{"$f":"SUM(ROUND(I63:J63,0))","v":0}]
["E-59",null,null,null,null,0,0,0,0,0,{"$f":"SUM(ROUND(I64:J64,0))","v":0}]
["E-60",null,null,null,null,0,0,0,0,0,{"$f":"SUM(ROUND(I65:J65,0))","v":0}]
["E-61",null,null,null,null,0,0,0,0,0,{"$f":"SUM(ROUND(I66:J66,0))","v":0}]
["E-62",null,null,null,null,0,0,0,0,0,{"$f":"SUM(ROUND(I67:J67,0))","v":0}]
["E-63",null,null,null,null,0,0,0,0,0,{"$f":"SUM(ROUND(I68:J68,0))","v":0}]
["E-64",null,null,null,null,0,0,0,0,0,{"$f":"SUM(ROUND(I69:J69,0))","v":0}]
["E-65",null,null,null,null,0,0,0,0,0,{"$f":"SUM(ROUND(I70:J70,0))","v":0}]
["E-66",null,null,null,null,0,0,{"$f":"IF(OR(F71=\"Redacted\",G71=\"Redacted\"),\"Redacted\",IF(OR(T(F71)<>\"\",T(G71)<>\"\"),\"Varies\",ROUND(F71*G71,0)))","v":0},0,0,{"$f":"SUM(ROUND(I71:J71,0))","v":0}]
["E-67",null,null,null,null,0,0,0,0,0,{"$f":"SUM(ROUND(I72:J72,0))","v":0}]
["E-68",null,null,null,null,0,0,0,0,0,{"$f":"SUM(ROUND(I73:J73,0))","v":0}]
["E-69",null,null,null,null,0,0,0,0,0,{"$f":"SUM(ROUND(I74:J74,0))","v":0}]
["E-70",null,null,null,null,0,0,0,0,0,{"$f":"SUM(ROUND(I75:J75,0))","v":0}]
["E-71",null,null,null,null,0,0,0,0,0,{"$f":"SUM(ROUND(I76:J76,0))","v":0}]
["E-72",null,null,null,null,0,0,0,0,0,{"$f":"SUM(ROUND(I77:J77,0))","v":0}]
["E-73",null,null,null,null,0,0,0,0,0,{"$f":"SUM(ROUND(I78:J78,0))","v":0}]
["E-74",null,null,null,null,0,0,0,0,0,{"$f":"SUM(ROUND(I79:J79,0))","v":0}]
["E-75",null,null,null,null,0,0,0,0,0,{"$f":"SUM(ROUND(I80:J80,0))","v":0}]
["E-76",null,null,null,null,0,0,0,0,0,{"$f":"SUM(ROUND(I81:J81,0))","v":0}]
["E-77",null,null,null,null,0,0,0,0,0,{"$f":"SUM(ROUND(I82:J82,0))","v":0}]
["E-78",null,null,null,null,0,0,0,0,0,{"$f":"SUM(ROUND(I83:J83,0))","v":0}]
["E-79",null,null,null,null,0,0,0,0,0,{"$f":"SUM(ROUND(I84:J84,0))","v":0}]
["E-80",null,null,null,null,0,0,0,0,0,{"$f":"SUM(ROUND(I85:J85,0))","v":0}]
["E-81",null,null,null,null,0,0,0,0,0,{"$f":"SUM(ROUND(I86:J86,0))","v":0}]
["E-82",null,null,null,null,0,0,0,0,0,{"$f":"SUM(ROUND(I87:J87,0))","v":0}]
["E-83",null,null,null,null,0,0,0,0,0,{"$f":"SUM(ROUND(I88:J88,0))","v":0}]
["E-84",null,null,null,null,0,0,0,0,0,{"$f":"SUM(ROUND(I89:J89,0))","v":0}]
["E-85",null,null,null,null,0,0,0,0,0,{"$f":"SUM(ROUND(I90:J90,0))","v":0}]
["E-86",null,null,null,null,0,0,0,0,0,{"$f":"SUM(ROUND(I91:J91,0))","v":0}]
["E-87",null,null,null,null,0,0,0,0,0,{"$f":"SUM(ROUND(I92:J92,0))","v":0}]
["E-88",null,null,null,null,0,0,0,0,0,{"$f":"SUM(ROUND(I93:J93,0))","v":0}]
["E-89",null,null,null,null,0,0,0,0,0,{"$f":"SUM(ROUND(I94:J94,0))","v":0}]
["E-90",null,null,null,null,0,0,0,0,0,{"$f":"SUM(ROUND(I95:J95,0))","v":0}]
["E-91",null,null,null,null,0,0,0,0,0,{"$f":"SUM(ROUND(I96:J96,0))","v":0}]
["E-92",null,null,null,null,0,0,0,0,0,{"$f":"SUM(ROUND(I97:J97,0))","v":0}]
["E-93",null,null,null,null,0,0,0,0,0,{"$f":"SUM(ROUND(I98:J98,0))","v":0}]
["E-94",null,null,null,null,0,0,0,0,0,{"$f":"SUM(ROUND(I99:J99,0))","v":0}]
["E-95",null,null,null,null,0,0,0,0,0,{"$f":"SUM(ROUND(I100:J100,0))","v":0}]
["E-96",null,null,null,null,0,0,0,0,0,{"$f":"SUM(ROUND(I101:J101,0))","v":0}]
["E-97",null,null,null,null,0,0,0,0,0,{"$f":"SUM(ROUND(I102:J102,0))","v":0}]
["E-98",null,null,null,null,0,0,0,0,0,{"$f":"SUM(ROUND(I103:J103,0))","v":0}]
["E-99",null,null,null,null,0,0,0,0,0,{"$f":"SUM(ROUND(I104:J104,0))","v":0}]
["E-100",null,null,null,null,0,0,0,0,0,{"$f":"SUM(ROUND(I105:J105,0))","v":0}]
["E-101",null,null,null,null,0,0,0,0,0,{"$f":"SUM(ROUND(I106:J106,0))","v":0}]
["E-102",null,null,null,null,0,0,0,0,0,{"$f":"SUM(ROUND(I107:J107,0))","v":0}]
["E-103",null,null,null,null,0,0,0,0,0,{"$f":"SUM(ROUND(I108:J108,0))","v":0}]
["E-104",null,null,null,null,0,0,0,0,0,{"$f":"SUM(ROUND(I109:J109,0))","v":0}]
["E-105",null,null,null,null,0,0,0,0,0,{"$f":"SUM(ROUND(I110:J110,0))","v":0}]
["E-106",null,null,null,null,0,0,0,0,0,{"$f":"SUM(ROUND(I111:J111,0))","v":0}]
["E-107",null,null,null,null,0,0,0,0,0,{"$f":"SUM(ROUND(I112:J112,0))","v":0}]
["E-108",null,null,null,null,0,0,0,0,0,{"$f":"SUM(ROUND(I113:J113,0))","v":0}]
["E-109",null,null,null,null,0,0,0,0,0,{"$f":"SUM(ROUND(I114:J114,0))","v":0}]
["E-110",null,null,null,null,0,0,0,0,0,{"$f":"SUM(ROUND(I115:J115,0))","v":0}]
["E-111",null,null,null,null,0,0,0,0,0,{"$f":"SUM(ROUND(I116:J116,0))","v":0}]
["E-112",null,null,null,null,0,0,0,0,0,{"$f":"SUM(ROUND(I117:J117,0))","v":0}]
["E-113",null,null,null,null,0,0,0,0,0,{"$f":"SUM(ROUND(I118:J118,0))","v":0}]
["E-114",null,null,null,null,0,0,0,0,0,{"$f":"SUM(ROUND(I119:J119,0))","v":0}]
["E-115",null,null,null,null,0,0,0,0,0,{"$f":"SUM(ROUND(I120:J120,0))","v":0}]
["E-116",null,null,null,null,0,0,0,0,0,{"$f":"SUM(ROUND(I121:J121,0))","v":0}]
["E-117",null,null,null,null,0,0,0,0,0,{"$f":"SUM(ROUND(I122:J122,0))","v":0}]
["E-118",null,null,null,null,0,0,0,0,0,{"$f":"SUM(ROUND(I123:J123,0))","v":0}]
["E-119",null,null,null,null,0,0,0,0,0,{"$f":"SUM(ROUND(I124:J124,0))","v":0}]
["E-120",null,null,null,null,0,0,0,0,0,{"$f":"SUM(ROUND(I125:J125,0))","v":0}]
["E-121",null,null,null,null,0,0,0,0,0,{"$f":"SUM(ROUND(I126:J126,0))","v":0}]
["E-122",null,null,null,null,0,0,0,0,0,{"$f":"SUM(ROUND(I127:J127,0))","v":0}]
["E-123",null,null,null,null,0,0,0,0,0,{"$f":"SUM(ROUND(I128:J128,0))","v":0}]
["E-124",null,null,null,null,0,0,0,0,0,{"$f":"SUM(ROUND(I129:J129,0))","v":0}]
["E-125",null,null,null,null,0,0,0,0,0,{"$f":"SUM(ROUND(I130:J130,0))","v":0}]
["E-126",null,null,null,null,0,0,0,0,0,{"$f":"SUM(ROUND(I131:J131,0))","v":0}]
["E-127",null,null,null,null,0,0,0,0,0,{"$f":"SUM(ROUND(I132:J132,0))","v":0}]
["E-128",null,null,null,null,0,0,0,0,0,{"$f":"SUM(ROUND(I133:J133,0))","v":0}]
["E-129",null,null,null,null,0,0,0,0,0,{"$f":"SUM(ROUND(I134:J134,0))","v":0}]
["E-130",null,null,null,null,0,0,{"$f":"IF(OR(F135=\"Redacted\",G135=\"Redacted\"),\"Redacted\",IF(OR(T(F135)<>\"\",T(G135)<>\"\"),\"Varies\",ROUND(F135*G135,0)))","v":0},0,0,{"$f":"SUM(ROUND(I135:J135,0))","v":0}]
["E-131",null,null,null,null,0,0,0,0,0,{"$f":"SUM(ROUND(I136:J136,0))","v":0}]
["E-132",null,null,null,null,0,0,0,0,0,{"$f":"SUM(ROUND(I137:J137,0))","v":0}]
["E-133",null,null,null,null,0,0,0,0,0,{"$f":"SUM(ROUND(I138:J138,0))","v":0}]
["E-134",null,null,null,null,0,0,0,0,0,{"$f":"SUM(ROUND(I139:J139,0))","v":0}]
["E-135",null,null,null,null,0,0,0,0,0,{"$f":"SUM(ROUND(I140:J140,0))","v":0}]
["E-136",null,null,null,null,0,0,0,0,0,{"$f":"SUM(ROUND(I141:J141,0))","v":0}]
["E-137",null,null,null,null,0,0,0,0,0,{"$f":"SUM(ROUND(I142:J142,0))","v":0}]
["E-138",null,null,null,null,0,0,0,0,0,{"$f":"SUM(ROUND(I143:J143,0))","v":0}]
["E-139",null,null,null,null,0,0,0,0,0,{"$f":"SUM(ROUND(I144:J144,0))","v":0}]
["E-140",null,null,null,null,0,0,0,0,0,{"$f":"SUM(ROUND(I145:J145,0))","v":0}]
["E-141",null,null,null,null,0,0,0,0,0,{"$f":"SUM(ROUND(I146:J146,0))","v":0}]
["E-142",null,null,null,null,0,0,0,0,0,{"$f":"SUM(ROUND(I147:J147,0))","v":0}]
["E-143",null,null,null,null,0,0,0,0,0,{"$f":"SUM(ROUND(I148:J148,0))","v":0}]
["E-144",null,null,null,null,0,0,0,0,0,{"$f":"SUM(ROUND(I149:J149,0))","v":0}]
["E-145",null,null,null,null,0,0,0,0,0,{"$f":"SUM(ROUND(I150:J150,0))","v":0}]
["E-146",null,null,null,null,0,0,0,0,0,{"$f":"SUM(ROUND(I151:J151,0))","v":0}]
["E-147",null,null,null,null,0,0,0,0,0,{"$f":"SUM(ROUND(I152:J152,0))","v":0}]
["E-148",null,null,null,null,0,0,0,0,0,{"$f":"SUM(ROUND(I153:J153,0))","v":0}]
["E-149",null,null,null,null,0,0,0,0,0,{"$f":"SUM(ROUND(I154:J154,0))","v":0}]
["E-150",null,null,null,null,0,0,0,0,0,{"$f":"SUM(ROUND(I155:J155,0))","v":0}]
["E-151",null,null,null,null,0,0,0,0,0,{"$f":"SUM(ROUND(I156:J156,0))","v":0}]
["E-152",null,null,null,null,0,0,0,0,0,{"$f":"SUM(ROUND(I157:J157,0))","v":0}]
["E-153",null,null,null,null,0,0,0,0,0,{"$f":"SUM(ROUND(I158:J158,0))","v":0}]
["E-154",null,null,null,null,0,0,0,0,0,{"$f":"SUM(ROUND(I159:J159,0))","v":0}]
["E-155",null,null,null,null,0,0,0,0,0,{"$f":"SUM(ROUND(I160:J160,0))","v":0}]
["E-156",null,null,null,null,0,0,0,0,0,{"$f":"SUM(ROUND(I161:J161,0))","v":0}]
["E-157",null,null,null,null,0,0,0,0,0,{"$f":"SUM(ROUND(I162:J162,0))","v":0}]
["E-158",null,null,null,null,0,0,0,0,0,{"$f":"SUM(ROUND(I163:J163,0))","v":0}]
["E-159",null,null,null,null,0,0,0,0,0,{"$f":"SUM(ROUND(I164:J164,0))","v":0}]
["E-160",null,null,null,null,0,0,0,0,0,{"$f":"SUM(ROUND(I165:J165,0))","v":0}]
["E-161",null,null,null,null,0,0,0,0,0,{"$f":"SUM(ROUND(I166:J166,0))","v":0}]
["E-162",null,null,null,null,0,0,0,0,0,{"$f":"SUM(ROUND(I167:J167,0))","v":0}]
["E-163",null,null,null,null,0,0,0,0,0,{"$f":"SUM(ROUND(I168:J168,0))","v":0}]
["E-164",null,null,null,null,0,0,0,0,0,{"$f":"SUM(ROUND(I169:J169,0))","v":0}]
["E-165",null,null,null,null,0,0,0,0,0,{"$f":"SUM(ROUND(I170:J170,0))","v":0}]
["E-166",null,null,null,null,0,0,0,0,0,{"$f":"SUM(ROUND(I171:J171,0))","v":0}]
["E-167",null,null,null,null,0,0,0,0,0,{"$f":"SUM(ROUND(I172:J172,0))","v":0}]
["E-168",null,null,null,null,0,0,0,0,0,{"$f":"SUM(ROUND(I173:J173,0))","v":0}]
["E-169",null,null,null,null,0,0,0,0,0,{"$f":"SUM(ROUND(I174:J174,0))","v":0}]
["E-170",null,null,null,null,0,0,0,0,0,{"$f":"SUM(ROUND(I175:J175,0))","v":0}]
["E-171",null,null,null,null,0,0,0,0,0,{"$f":"SUM(ROUND(I176:J176,0))","v":0}]
["E-172",null,null,null,null,0,0,0,0,0,{"$f":"SUM(ROUND(I177:J177,0))","v":0}]
["E-173",null,null,null,null,0,0,0,0,0,{"$f":"SUM(ROUND(I178:J178,0))","v":0}]
["E-174",null,null,null,null,0,0,0,0,0,{"$f":"SUM(ROUND(I179:J179,0))","v":0}]
["E-175",null,null,null,null,0,0,0,0,0,{"$f":"SUM(ROUND(I180:J180,0))","v":0}]
["E-176",null,null,null,null,0,0,0,0,0,{"$f":"SUM(ROUND(I181:J181,0))","v":0}]
["E-177",null,null,null,null,0,0,0,0,0,{"$f":"SUM(ROUND(I182:J182,0))","v":0}]
["E-178",null,null,null,null,0,0,0,0,0,{"$f":"SUM(ROUND(I183:J183,0))","v":0}]
["E-179",null,null,null,null,0,0,0,0,0,{"$f":"SUM(ROUND(I184:J184,0))","v":0}]
["E-180",null,null,null,null,0,0,0,0,0,{"$f":"SUM(ROUND(I185:J185,0))","v":0}]
["E-181",null,null,null,null,0,0,0,0,0,{"$f":"SUM(ROUND(I186:J186,0))","v":0}]
["E-182",null,null,null,null,0,0,0,0,0,{"$f":"SUM(ROUND(I187:J187,0))","v":0}]
["E-183",null,null,null,null,0,0,0,0,0,{"$f":"SUM(ROUND(I188:J188,0))","v":0}]
["E-184",null,null,null,null,0,0,0,0,0,{"$f":"SUM(ROUND(I189:J189,0))","v":0}]
["E-185",null,null,null,null,0,0,0,0,0,{"$f":"SUM(ROUND(I190:J190,0))","v":0}]
["E-186",null,null,null,null,0,0,0,0,0,{"$f":"SUM(ROUND(I191:J191,0))","v":0}]
["E-187",null,null,null,null,0,0,0,0,0,{"$f":"SUM(ROUND(I192:J192,0))","v":0}]
["E-188",null,null,null,null,0,0,0,0,0,{"$f":"SUM(ROUND(I193:J193,0))","v":0}]
["E-189",null,null,null,null,0,0,0,0,0,{"$f":"SUM(ROUND(I194:J194,0))","v":0}]
["E-190",null,null,null,null,0,0,0,0,0,{"$f":"SUM(ROUND(I195:J195,0))","v":0}]
["E-191",null,null,null,null,0,0,0,0,0,{"$f":"SUM(ROUND(I196:J196,0))","v":0}]
["E-192",null,null,null,null,0,0,0,0,0,{"$f":"SUM(ROUND(I197:J197,0))","v":0}]
["E-193",null,null,null,null,0,0,0,0,0,{"$f":"SUM(ROUND(I198:J198,0))","v":0}]
["E-194",null,null,null,null,0,0,{"$f":"IF(OR(F199=\"Redacted\",G199=\"Redacted\"),\"Redacted\",IF(OR(T(F199)<>\"\",T(G199)<>\"\"),\"Varies\",ROUND(F199*G199,0)))","v":0},0,0,{"$f":"SUM(ROUND(I199:J199,0))","v":0}]
["E-195",null,null,null,null,0,0,0,0,0,{"$f":"SUM(ROUND(I200:J200,0))","v":0}]
["E-196",null,null,null,null,0,0,0,0,0,{"$f":"SUM(ROUND(I201:J201,0))","v":0}]
["E-197",null,null,null,null,0,0,0,0,0,{"$f":"SUM(ROUND(I202:J202,0))","v":0}]
["E-198",null,null,null,null,0,0,0,0,0,{"$f":"SUM(ROUND(I203:J203,0))","v":0}]
["E-199",null,null,null,null,0,0,0,0,0,{"$f":"SUM(ROUND(I204:J204,0))","v":0}]
["E-200",null,null,null,null,0,0,0,0,0,{"$f":"SUM(ROUND(I205:J205,0))","v":0}]
["E-201",null,"CEC USE ONLY",null,null,0,0,0,0,0,{"$f":"SUM(ROUND(I206:J206,0))","v":0}]
["E-202",null,"CEC USE ONLY",null,null,0,0,0,0,0,{"$f":"SUM(ROUND(I207:J207,0))","v":0}]
["Grand Totals",null,null,null,null,null,null,null,{"$f":"SUM(ROUND(I6:I207,0))","v":0},{"$f":"SUM(ROUND(J6:J207,0))","v":0},{"$f":"SUM(K6:K207)","v":0}]

{"sheet":"Materials & Misc.","index":6,"n_rows":208,"n_cols":16,"rows_kept":208,"cut":false,"hidden":false,"merged":[[0,0,0,2],[207,0,207,7],[1,0,1,10],[2,0,2,10],[3,0,3,10],[0,9,0,10]]}
[{"$f":"'Category Budget'!$A$1","v":"Template Version 08/23/2021"},null,null,null,null,null,null,null,null,null,null,null,null,null,null,"SANDBOX AREA (highlighted in light red)- For rough work associated with the print area to the left.  Rough work may include, notes, calculations, derivations, etc."]
["PROPOSAL BUDGET"]
["Materials & Miscellaneous"]
[{"$f":"CONCATENATE('Category Budget'!$B$4,\":  \",'Category Budget'!$B$5)","v":"GFO-22-607:  Organization Name"}]
["Reference ID","Task #","Seller of item(s)","Description","Purpose","# of Units","Unit Cost","Total:  \n# of Units x Unit Cost","CEC\nShare","Match\nShare","Total"]
["M-1",null,null,null,null,0,0,{"$f":"IF(OR(F6=\"Redacted\",G6=\"Redacted\"),\"Redacted\",IF(OR(T(F6)<>\"\",T(G6)<>\"\"),\"Varies\",ROUND(F6*G6,0)))","v":0},0,0,{"$f":"SUM(ROUND(I6:J6,0))","v":0}]
["M-2",null,null,null,null,0,0,{"$f":"IF(OR(F7=\"Redacted\",G7=\"Redacted\"),\"Redacted\",IF(OR(T(F7)<>\"\",T(G7)<>\"\"),\"Varies\",ROUND(F7*G7,0)))","v":0},0,0,{"$f":"SUM(ROUND(I7:J7,0))","v":0}]
["M-3",null,null,null,null,0,0,0,0,0,{"$f":"SUM(ROUND(I8:J8,0))","v":0}]
["M-4",null,null,null,null,0,0,0,0,0,{"$f":"SUM(ROUND(I9:J9,0))","v":0}]
["M-5",null,null,null,null,0,0,0,0,0,{"$f":"SUM(ROUND(I10:J10,0))","v":0}]
["M-6",null,null,null,null,0,0,0,0,0,{"$f":"SUM(ROUND(I11:J11,0))","v":0}]
["M-7",null,null,null,null,0,0,0,0,0,{"$f":"SUM(ROUND(I12:J12,0))","v":0}]
["M-8",null,null,null,null,0,0,0,0,0,{"$f":"SUM(ROUND(I13:J13,0))","v":0}]
["M-9",null,null,null,null,0,0,0,0,0,{"$f":"SUM(ROUND(I14:J14,0))","v":0}]
["M-10",null,null,null,null,0,0,0,0,0,{"$f":"SUM(ROUND(I15:J15,0))","v":0}]
["M-11",null,null,null,null,0,0,0,0,0,{"$f":"SUM(ROUND(I16:J16,0))","v":0}]
["M-12",null,null,null,null,0,0,0,0,0,{"$f":"SUM(ROUND(I17:J17,0))","v":0}]
["M-13",null,null,null,null,0,0,0,0,0,{"$f":"SUM(ROUND(I18:J18,0))","v":0}]
["M-14",null,null,null,null,0,0,0,0,0,{"$f":"SUM(ROUND(I19:J19,0))","v":0}]
["M-15",null,null,null,null,0,0,0,0,0,{"$f":"SUM(ROUND(I20:J20,0))","v":0}]
["M-16",null,null,null,null,0,0,0,0,0,{"$f":"SUM(ROUND(I21:J21,0))","v":0}]
["M-17",null,null,null,null,0,0,0,0,0,{"$f":"SUM(ROUND(I22:J22,0))","v":0}]
["M-18",null,null,null,null,0,0,0,0,0,{"$f":"SUM(ROUND(I23:J23,0))","v":0}]
["M-19",null,null,null,null,0,0,0,0,0,{"$f":"SUM(ROUND(I24:J24,0))","v":0}]
["M-20",null,null,null,null,0,0,0,0,0,{"$f":"SUM(ROUND(I25:J25,0))","v":0}]
["M-21",null,null,null,null,0,0,0,0,0,{"$f":"SUM(ROUND(I26:J26,0))","v":0}]
["M-22",null,null,null,null,0,0,0,0,0,{"$f":"SUM(ROUND(I27:J27,0))","v":0}]
["M-23",null,null,null,null,0,0,0,0,0,{"$f":"SUM(ROUND(I28:J28,0))","v":0}]
["M-24",null,null,null,null,0,0,0,0,0,{"$f":"SUM(ROUND(I29:J29,0))","v":0}]
["M-25",null,null,null,null,0,0,0,0,0,{"$f":"SUM(ROUND(I30:J30,0))","v":0}]
["M-26",null,null,null,null,0,0,0,0,0,{"$f":"SUM(ROUND(I31:J31,0))","v":0}]
["M-27",null,null,null,null,0,0,0,0,0,{"$f":"SUM(ROUND(I32:J32,0))","v":0}]
["M-28",null,null,null,null,0,0,0,0,0,{"$f":"SUM(ROUND(I33:J33,0))","v":0}]
["M-29",null,null,null,null,0,0,0,0,0,{"$f":"SUM(ROUND(I34:J34,0))","v":0}]
["M-30",null,null,null,null,0,0,0,0,0,{"$f":"SUM(ROUND(I35:J35,0))","v":0}]
["M-31",null,null,null,null,0,0,0,0,0,{"$f":"SUM(ROUND(I36:J36,0))","v":0}]
["M-32",null,null,null,null,0,0,0,0,0,{"$f":"SUM(ROUND(I37:J37,0))","v":0}]
["M-33",null,null,null,null,0,0,0,0,0,{"$f":"SUM(ROUND(I38:J38,0))","v":0}]
["M-34",null,null,null,null,0,0,0,0,0,{"$f":"SUM(ROUND(I39:J39,0))","v":0}]
["M-35",null,null,null,null,0,0,0,0,0,{"$f":"SUM(ROUND(I40:J40,0))","v":0}]
["M-36",null,null,null,null,0,0,0,0,0,{"$f":"SUM(ROUND(I41:J41,0))","v":0}]
["M-37",null,null,null,null,0,0,0,0,0,{"$f":"SUM(ROUND(I42:J42,0))","v":0}]
["M-38",null,null,null,null,0,0,0,0,0,{"$f":"SUM(ROUND(I43:J43,0))","v":0}]
["M-39",null,null,null,null,0,0,0,0,0,{"$f":"SUM(ROUND(I44:J44,0))","v":0}]
["M-40",null,null,null,null,0,0,0,0,0,{"$f":"SUM(ROUND(I45:J45,0))","v":0}]
["M-41",null,null,null,null,0,0,0,0,0,{"$f":"SUM(ROUND(I46:J46,0))","v":0}]
["M-42",null,null,null,null,0,0,0,0,0,{"$f":"SUM(ROUND(I47:J47,0))","v":0}]
["M-43",null,null,null,null,0,0,0,0,0,{"$f":"SUM(ROUND(I48:J48,0))","v":0}]
["M-44",null,null,null,null,0,0,0,0,0,{"$f":"SUM(ROUND(I49:J49,0))","v":0}]
["M-45",null,null,null,null,0,0,0,0,0,{"$f":"SUM(ROUND(I50:J50,0))","v":0}]
["M-46",null,null,null,null,0,0,0,0,0,{"$f":"SUM(ROUND(I51:J51,0))","v":0}]
["M-47",null,null,null,null,0,0,0,0,0,{"$f":"SUM(ROUND(I52:J52,0))","v":0}]
["M-48",null,null,null,null,0,0,0,0,0,{"$f":"SUM(ROUND(I53:J53,0))","v":0}]
["M-49",null,null,null,null,0,0,0,0,0,{"$f":"SUM(ROUND(I54:J54,0))","v":0}]
["M-50",null,null,null,null,0,0,0,0,0,{"$f":"SUM(ROUND(I55:J55,0))","v":0}]
["M-51",null,null,null,null,0,0,0,0,0,{"$f":"SUM(ROUND(I56:J56,0))","v":0}]
["M-52",null,null,null,null,0,0,0,0,0,{"$f":"SUM(ROUND(I57:J57,0))","v":0}]
["M-53",null,null,null,null,0,0,0,0,0,{"$f":"SUM(ROUND(I58:J58,0))","v":0}]
["M-54",null,null,null,null,0,0,0,0,0,{"$f":"SUM(ROUND(I59:J59,0))","v":0}]
["M-55",null,null,null,null,0,0,0,0,0,{"$f":"SUM(ROUND(I60:J60,0))","v":0}]
["M-56",null,null,null,null,0,0,0,0,0,{"$f":"SUM(ROUND(I61:J61,0))","v":0}]
["M-57",null,null,null,null,0,0,0,0,0,{"$f":"SUM(ROUND(I62:J62,0))","v":0}]
["M-58",null,null,null,null,0,0,0,0,0,{"$f":"SUM(ROUND(I63:J63,0))","v":0}]
["M-59",null,null,null,null,0,0,0,0,0,{"$f":"SUM(ROUND(I64:J64,0))","v":0}]
["M-60",null,null,null,null,0,0,0,0,0,{"$f":"SUM(ROUND(I65:J65,0))","v":0}]
["M-61",null,null,null,null,0,0,0,0,0,{"$f":"SUM(ROUND(I66:J66,0))","v":0}]
["M-62",null,null,null,null,0,0,0,0,0,{"$f":"SUM(ROUND(I67:J67,0))","v":0}]
["M-63",null,null,null,null,0,0,0,0,0,{"$f":"SUM(ROUND(I68:J68,0))","v":0}]
["M-64",null,null,null,null,0,0,0,0,0,{"$f":"SUM(ROUND(I69:J69,0))","v":0}]
["M-65",null,null,null,null,0,0,0,0,0,{"$f":"SUM(ROUND(I70:J70,0))","v":0}]
["M-66",null,null,null,null,0,0,{"$f":"IF(OR(F71=\"Redacted\",G71=\"Redacted\"),\"Redacted\",IF(OR(T(F71)<>\"\",T(G71)<>\"\"),\"Varies\",ROUND(F71*G71,0)))","v":0},0,0,{"$f":"SUM(ROUND(I71:J71,0))","v":0}]
["M-67",null,null,null,null,0,0,0,0,0,{"$f":"SUM(ROUND(I72:J72,0))","v":0}]
["M-68",null,null,null,null,0,0,0,0,0,{"$f":"SUM(ROUND(I73:J73,0))","v":0}]
["M-69",null,null,null,null,0,0,0,0,0,{"$f":"SUM(ROUND(I74:J74,0))","v":0}]
["M-70",null,null,null,null,0,0,0,0,0,{"$f":"SUM(ROUND(I75:J75,0))","v":0}]
["M-71",null,null,null,null,0,0,0,0,0,{"$f":"SUM(ROUND(I76:J76,0))","v":0}]
["M-72",null,null,null,null,0,0,0,0,0,{"$f":"SUM(ROUND(I77:J77,0))","v":0}]
["M-73",null,null,null,null,0,0,0,0,0,{"$f":"SUM(ROUND(I78:J78,0))","v":0}]
["M-74",null,null,null,null,0,0,0,0,0,{"$f":"SUM(ROUND(I79:J79,0))","v":0}]
["M-75",null,null,null,null,0,0,0,0,0,{"$f":"SUM(ROUND(I80:J80,0))","v":0}]
["M-76",null,null,null,null,0,0,0,0,0,{"$f":"SUM(ROUND(I81:J81,0))","v":0}]
["M-77",null,null,null,null,0,0,0,0,0,{"$f":"SUM(ROUND(I82:J82,0))","v":0}]
["M-78",null,null,null,null,0,0,0,0,0,{"$f":"SUM(ROUND(I83:J83,0))","v":0}]
["M-79",null,null,null,null,0,0,0,0,0,{"$f":"SUM(ROUND(I84:J84,0))","v":0}]
["M-80",null,null,null,null,0,0,0,0,0,{"$f":"SUM(ROUND(I85:J85,0))","v":0}]
["M-81",null,null,null,null,0,0,0,0,0,{"$f":"SUM(ROUND(I86:J86,0))","v":0}]
["M-82",null,null,null,null,0,0,0,0,0,{"$f":"SUM(ROUND(I87:J87,0))","v":0}]
["M-83",null,null,null,null,0,0,0,0,0,{"$f":"SUM(ROUND(I88:J88,0))","v":0}]
["M-84",null,null,null,null,0,0,0,0,0,{"$f":"SUM(ROUND(I89:J89,0))","v":0}]
["M-85",null,null,null,null,0,0,0,0,0,{"$f":"SUM(ROUND(I90:J90,0))","v":0}]
["M-86",null,null,null,null,0,0,0,0,0,{"$f":"SUM(ROUND(I91:J91,0))","v":0}]
["M-87",null,null,null,null,0,0,0,0,0,{"$f":"SUM(ROUND(I92:J92,0))","v":0}]
["M-88",null,null,null,null,0,0,0,0,0,{"$f":"SUM(ROUND(I93:J93,0))","v":0}]
["M-89",null,null,null,null,0,0,0,0,0,{"$f":"SUM(ROUND(I94:J94,0))","v":0}]
["M-90",null,null,null,null,0,0,0,0,0,{"$f":"SUM(ROUND(I95:J95,0))","v":0}]
["M-91",null,null,null,null,0,0,0,0,0,{"$f":"SUM(ROUND(I96:J96,0))","v":0}]
["M-92",null,null,null,null,0,0,0,0,0,{"$f":"SUM(ROUND(I97:J97,0))","v":0}]
["M-93",null,null,null,null,0,0,0,0,0,{"$f":"SUM(ROUND(I98:J98,0))","v":0}]
["M-94",null,null,null,null,0,0,0,0,0,{"$f":"SUM(ROUND(I99:J99,0))","v":0}]
["M-95",null,null,null,null,0,0,0,0,0,{"$f":"SUM(ROUND(I100:J100,0))","v":0}]
["M-96",null,null,null,null,0,0,0,0,0,{"$f":"SUM(ROUND(I101:J101,0))","v":0}]
["M-97",null,null,null,null,0,0,0,0,0,{"$f":"SUM(ROUND(I102:J102,0))","v":0}]
["M-98",null,null,null,null,0,0,0,0,0,{"$f":"SUM(ROUND(I103:J103,0))","v":0}]
["M-99",null,null,null,null,0,0,0,0,0,{"$f":"SUM(ROUND(I104:J104,0))","v":0}]
["M-100",null,null,null,null,0,0,0,0,0,{"$f":"SUM(ROUND(I105:J105,0))","v":0}]
["M-101",null,null,null,null,0,0,0,0,0,{"$f":"SUM(ROUND(I106:J106,0))","v":0}]
["M-102",null,null,null,null,0,0,0,0,0,{"$f":"SUM(ROUND(I107:J107,0))","v":0}]
["M-103",null,null,null,null,0,0,0,0,0,{"$f":"SUM(ROUND(I108:J108,0))","v":0}]
["M-104",null,null,null,null,0,0,0,0,0,{"$f":"SUM(ROUND(I109:J109,0))","v":0}]
["M-105",null,null,null,null,0,0,0,0,0,{"$f":"SUM(ROUND(I110:J110,0))","v":0}]
["M-106",null,null,null,null,0,0,0,0,0,{"$f":"SUM(ROUND(I111:J111,0))","v":0}]
["M-107",null,null,null,null,0,0,0,0,0,{"$f":"SUM(ROUND(I112:J112,0))","v":0}]
["M-108",null,null,null,null,0,0,0,0,0,{"$f":"SUM(ROUND(I113:J113,0))","v":0}]
["M-109",null,null,null,null,0,0,0,0,0,{"$f":"SUM(ROUND(I114:J114,0))","v":0}]
["M-110",null,null,null,null,0,0,0,0,0,{"$f":"SUM(ROUND(I115:J115,0))","v":0}]
["M-111",null,null,null,null,0,0,0,0,0,{"$f":"SUM(ROUND(I116:J116,0))","v":0}]
["M-112",null,null,null,null,0,0,0,0,0,{"$f":"SUM(ROUND(I117:J117,0))","v":0}]
["M-113",null,null,null,null,0,0,0,0,0,{"$f":"SUM(ROUND(I118:J118,0))","v":0}]
["M-114",null,null,null,null,0,0,0,0,0,{"$f":"SUM(ROUND(I119:J119,0))","v":0}]
["M-115",null,null,null,null,0,0,0,0,0,{"$f":"SUM(ROUND(I120:J120,0))","v":0}]
["M-116",null,null,null,null,0,0,0,0,0,{"$f":"SUM(ROUND(I121:J121,0))","v":0}]
["M-117",null,null,null,null,0,0,0,0,0,{"$f":"SUM(ROUND(I122:J122,0))","v":0}]
["M-118",null,null,null,null,0,0,0,0,0,{"$f":"SUM(ROUND(I123:J123,0))","v":0}]
["M-119",null,null,null,null,0,0,0,0,0,{"$f":"SUM(ROUND(I124:J124,0))","v":0}]
["M-120",null,null,null,null,0,0,0,0,0,{"$f":"SUM(ROUND(I125:J125,0))","v":0}]
["M-121",null,null,null,null,0,0,0,0,0,{"$f":"SUM(ROUND(I126:J126,0))","v":0}]
["M-122",null,null,null,null,0,0,0,0,0,{"$f":"SUM(ROUND(I127:J127,0))","v":0}]
["M-123",null,null,null,null,0,0,0,0,0,{"$f":"SUM(ROUND(I128:J128,0))","v":0}]
["M-124",null,null,null,null,0,0,0,0,0,{"$f":"SUM(ROUND(I129:J129,0))","v":0}]
["M-125",null,null,null,null,0,0,0,0,0,{"$f":"SUM(ROUND(I130:J130,0))","v":0}]
["M-126",null,null,null,null,0,0,0,0,0,{"$f":"SUM(ROUND(I131:J131,0))","v":0}]
["M-127",null,null,null,null,0,0,0,0,0,{"$f":"SUM(ROUND(I132:J132,0))","v":0}]
["M-128",null,null,null,null,0,0,0,0,0,{"$f":"SUM(ROUND(I133:J133,0))","v":0}]
["M-129",null,null,null,null,0,0,0,0,0,{"$f":"SUM(ROUND(I134:J134,0))","v":0}]
["M-130",null,null,null,null,0,0,{"$f":"IF(OR(F135=\"Redacted\",G135=\"Redacted\"),\"Redacted\",IF(OR(T(F135)<>\"\",T(G135)<>\"\"),\"Varies\",ROUND(F135*G135,0)))","v":0},0,0,{"$f":"SUM(ROUND(I135:J135,0))","v":0}]
["M-131",null,null,null,null,0,0,0,0,0,{"$f":"SUM(ROUND(I136:J136,0))","v":0}]
["M-132",null,null,null,null,0,0,0,0,0,{"$f":"SUM(ROUND(I137:J137,0))","v":0}]
["M-133",null,null,null,null,0,0,0,0,0,{"$f":"SUM(ROUND(I138:J138,0))","v":0}]
["M-134",null,null,null,null,0,0,0,0,0,{"$f":"SUM(ROUND(I139:J139,0))","v":0}]
["M-135",null,null,null,null,0,0,0,0,0,{"$f":"SUM(ROUND(I140:J140,0))","v":0}]
["M-136",null,null,null,null,0,0,0,0,0,{"$f":"SUM(ROUND(I141:J141,0))","v":0}]
["M-137",null,null,null,null,0,0,0,0,0,{"$f":"SUM(ROUND(I142:J142,0))","v":0}]
["M-138",null,null,null,null,0,0,0,0,0,{"$f":"SUM(ROUND(I143:J143,0))","v":0}]
["M-139",null,null,null,null,0,0,0,0,0,{"$f":"SUM(ROUND(I144:J144,0))","v":0}]
["M-140",null,null,null,null,0,0,0,0,0,{"$f":"SUM(ROUND(I145:J145,0))","v":0}]
["M-141",null,null,null,null,0,0,0,0,0,{"$f":"SUM(ROUND(I146:J146,0))","v":0}]
["M-142",null,null,null,null,0,0,0,0,0,{"$f":"SUM(ROUND(I147:J147,0))","v":0}]
["M-143",null,null,null,null,0,0,0,0,0,{"$f":"SUM(ROUND(I148:J148,0))","v":0}]
["M-144",null,null,null,null,0,0,0,0,0,{"$f":"SUM(ROUND(I149:J149,0))","v":0}]
["M-145",null,null,null,null,0,0,0,0,0,{"$f":"SUM(ROUND(I150:J150,0))","v":0}]
["M-146",null,null,null,null,0,0,0,0,0,{"$f":"SUM(ROUND(I151:J151,0))","v":0}]
["M-147",null,null,null,null,0,0,0,0,0,{"$f":"SUM(ROUND(I152:J152,0))","v":0}]
["M-148",null,null,null,null,0,0,0,0,0,{"$f":"SUM(ROUND(I153:J153,0))","v":0}]
["M-149",null,null,null,null,0,0,0,0,0,{"$f":"SUM(ROUND(I154:J154,0))","v":0}]
["M-150",null,null,null,null,0,0,0,0,0,{"$f":"SUM(ROUND(I155:J155,0))","v":0}]
["M-151",null,null,null,null,0,0,0,0,0,{"$f":"SUM(ROUND(I156:J156,0))","v":0}]
["M-152",null,null,null,null,0,0,0,0,0,{"$f":"SUM(ROUND(I157:J157,0))","v":0}]
["M-153",null,null,null,null,0,0,0,0,0,{"$f":"SUM(ROUND(I158:J158,0))","v":0}]
["M-154",null,null,null,null,0,0,0,0,0,{"$f":"SUM(ROUND(I159:J159,0))","v":0}]
["M-155",null,null,null,null,0,0,0,0,0,{"$f":"SUM(ROUND(I160:J160,0))","v":0}]
["M-156",null,null,null,null,0,0,0,0,0,{"$f":"SUM(ROUND(I161:J161,0))","v":0}]
["M-157",null,null,null,null,0,0,0,0,0,{"$f":"SUM(ROUND(I162:J162,0))","v":0}]
["M-158",null,null,null,null,0,0,0,0,0,{"$f":"SUM(ROUND(I163:J163,0))","v":0}]
["M-159",null,null,null,null,0,0,0,0,0,{"$f":"SUM(ROUND(I164:J164,0))","v":0}]
["M-160",null,null,null,null,0,0,0,0,0,{"$f":"SUM(ROUND(I165:J165,0))","v":0}]
["M-161",null,null,null,null,0,0,0,0,0,{"$f":"SUM(ROUND(I166:J166,0))","v":0}]
["M-162",null,null,null,null,0,0,0,0,0,{"$f":"SUM(ROUND(I167:J167,0))","v":0}]
["M-163",null,null,null,null,0,0,0,0,0,{"$f":"SUM(ROUND(I168:J168,0))","v":0}]
["M-164",null,null,null,null,0,0,0,0,0,{"$f":"SUM(ROUND(I169:J169,0))","v":0}]
["M-165",null,null,null,null,0,0,0,0,0,{"$f":"SUM(ROUND(I170:J170,0))","v":0}]
["M-166",null,null,null,null,0,0,0,0,0,{"$f":"SUM(ROUND(I171:J171,0))","v":0}]
["M-167",null,null,null,null,0,0,0,0,0,{"$f":"SUM(ROUND(I172:J172,0))","v":0}]
["M-168",null,null,null,null,0,0,0,0,0,{"$f":"SUM(ROUND(I173:J173,0))","v":0}]
["M-169",null,null,null,null,0,0,0,0,0,{"$f":"SUM(ROUND(I174:J174,0))","v":0}]
["M-170",null,null,null,null,0,0,0,0,0,{"$f":"SUM(ROUND(I175:J175,0))","v":0}]
["M-171",null,null,null,null,0,0,0,0,0,{"$f":"SUM(ROUND(I176:J176,0))","v":0}]
["M-172",null,null,null,null,0,0,0,0,0,{"$f":"SUM(ROUND(I177:J177,0))","v":0}]
["M-173",null,null,null,null,0,0,0,0,0,{"$f":"SUM(ROUND(I178:J178,0))","v":0}]
["M-174",null,null,null,null,0,0,0,0,0,{"$f":"SUM(ROUND(I179:J179,0))","v":0}]
["M-175",null,null,null,null,0,0,0,0,0,{"$f":"SUM(ROUND(I180:J180,0))","v":0}]
["M-176",null,null,null,null,0,0,0,0,0,{"$f":"SUM(ROUND(I181:J181,0))","v":0}]
["M-177",null,null,null,null,0,0,0,0,0,{"$f":"SUM(ROUND(I182:J182,0))","v":0}]
["M-178",null,null,null,null,0,0,0,0,0,{"$f":"SUM(ROUND(I183:J183,0))","v":0}]
["M-179",null,null,null,null,0,0,0,0,0,{"$f":"SUM(ROUND(I184:J184,0))","v":0}]
["M-180",null,null,null,null,0,0,0,0,0,{"$f":"SUM(ROUND(I185:J185,0))","v":0}]
["M-181",null,null,null,null,0,0,0,0,0,{"$f":"SUM(ROUND(I186:J186,0))","v":0}]
["M-182",null,null,null,null,0,0,0,0,0,{"$f":"SUM(ROUND(I187:J187,0))","v":0}]
["M-183",null,null,null,null,0,0,0,0,0,{"$f":"SUM(ROUND(I188:J188,0))","v":0}]
["M-184",null,null,null,null,0,0,0,0,0,{"$f":"SUM(ROUND(I189:J189,0))","v":0}]
["M-185",null,null,null,null,0,0,0,0,0,{"$f":"SUM(ROUND(I190:J190,0))","v":0}]
["M-186",null,null,null,null,0,0,0,0,0,{"$f":"SUM(ROUND(I191:J191,0))","v":0}]
["M-187",null,null,null,null,0,0,0,0,0,{"$f":"SUM(ROUND(I192:J192,0))","v":0}]
["M-188",null,null,null,null,0,0,0,0,0,{"$f":"SUM(ROUND(I193:J193,0))","v":0}]
["M-189",null,null,null,null,0,0,0,0,0,{"$f":"SUM(ROUND(I194:J194,0))","v":0}]
["M-190",null,null,null,null,0,0,0,0,0,{"$f":"SUM(ROUND(I195:J195,0))","v":0}]
["M-191",null,null,null,null,0,0,0,0,0,{"$f":"SUM(ROUND(I196:J196,0))","v":0}]
["M-192",null,null,null,null,0,0,0,0,0,{"$f":"SUM(ROUND(I197:J197,0))","v":0}]
["M-193",null,null,null,null,0,0,0,0,0,{"$f":"SUM(ROUND(I198:J198,0))","v":0}]
["M-194",null,null,null,null,0,0,{"$f":"IF(OR(F199=\"Redacted\",G199=\"Redacted\"),\"Redacted\",IF(OR(T(F199)<>\"\",T(G199)<>\"\"),\"Varies\",ROUND(F199*G199,0)))","v":0},0,0,{"$f":"SUM(ROUND(I199:J199,0))","v":0}]
["M-195",null,null,null,null,0,0,0,0,0,{"$f":"SUM(ROUND(I200:J200,0))","v":0}]
["M-196",null,null,null,null,0,0,0,0,0,{"$f":"SUM(ROUND(I201:J201,0))","v":0}]
["M-197",null,null,null,null,0,0,0,0,0,{"$f":"SUM(ROUND(I202:J202,0))","v":0}]
["M-198",null,null,null,null,0,0,0,0,0,{"$f":"SUM(ROUND(I203:J203,0))","v":0}]
["M-199",null,null,null,null,0,0,0,0,0,{"$f":"SUM(ROUND(I204:J204,0))","v":0}]
["M-200",null,null,null,null,0,0,0,0,0,{"$f":"SUM(ROUND(I205:J205,0))","v":0}]
["M-201",null,"CEC USE ONLY",null,null,0,0,0,0,0,{"$f":"SUM(ROUND(I206:J206,0))","v":0}]
["M-202",null,"CEC USE ONLY",null,null,0,0,{"$f":"IF(OR(F207=\"Redacted\",G207=\"Redacted\"),\"Redacted\",IF(OR(T(F207)<>\"\",T(G207)<>\"\"),\"Varies\",ROUND(F207*G207,0)))","v":0},0,0,{"$f":"SUM(ROUND(I207:J207,0))","v":0}]
["Grand Totals",null,null,null,null,null,null,null,{"$f":"SUM(ROUND(I6:I207,0))","v":0},{"$f":"SUM(ROUND(J6:J207,0))","v":0},{"$f":"SUM(K6:K207)","v":0}]

{"sheet":"Subrecipients & Vendors","index":7,"n_rows":115,"n_cols":14,"rows_kept":115,"cut":false,"hidden":false,"merged":[[112,0,112,8],[114,0,114,5],[113,0,113,5],[110,0,110,5],[0,7,0,8],[58,0,58,8],[0,0,0,2],[56,0,56,5],[1,0,1,8],[2,0,2,8],[3,0,3,8],[4,0,4,8]]}
[{"$f":"'Category Budget'!$A$1","v":"Template Version 08/23/2021"},null,null,null,null,null,null,null,null,null,null,null,null,"SANDBOX AREA (highlighted in light red)- For rough work associated with the print area to the left.  Rough work may include, notes, calculations, derivations, etc."]
["PROPOSAL BUDGET"]
["Subrecipients & Vendors"]
[{"$f":"CONCATENATE('Category Budget'!$B$4,\":  \",'Category Budget'!$B$5)","v":"GFO-22-607:  Organization Name"}]
["Subrecipients"]
["Reference ID","Task #","Subrecipient\n(Please Use Legal Name)","Entity Number\n(CA Secretary of State)","Purpose","CA Business Certifications DVBE/ SB/MB/None","CEC\nShare","Match\nShare","Total"]
["S-1",null,null,null,null,"None",0,0,{"$f":"SUM(ROUND(G7:H7,0))","v":0}]
["S-2",null,null,null,null,"None",0,0,{"$f":"SUM(ROUND(G8:H8,0))","v":0}]
["S-3",null,null,null,null,"None",0,0,{"$f":"SUM(ROUND(G9:H9,0))","v":0}]
["S-4",null,null,null,null,"None",0,0,{"$f":"SUM(ROUND(G10:H10,0))","v":0}]
["S-5",null,null,null,null,"None",0,0,{"$f":"SUM(ROUND(G11:H11,0))","v":0}]
["S-6",null,null,null,null,"None",0,0,{"$f":"SUM(ROUND(G12:H12,0))","v":0}]
["S-7",null,null,null,null,"None",0,0,{"$f":"SUM(ROUND(G13:H13,0))","v":0}]
["S-8",null,null,null,null,"None",0,0,{"$f":"SUM(ROUND(G14:H14,0))","v":0}]
["S-9",null,null,null,null,"None",0,0,{"$f":"SUM(ROUND(G15:H15,0))","v":0}]
["S-10",null,null,null,null,"None",0,0,{"$f":"SUM(ROUND(G16:H16,0))","v":0}]
["S-11",null,null,null,null,"None",0,0,{"$f":"SUM(ROUND(G17:H17,0))","v":0}]
["S-12",null,null,null,null,"None",0,0,{"$f":"SUM(ROUND(G18:H18,0))","v":0}]
["S-13",null,null,null,null,"None",0,0,{"$f":"SUM(ROUND(G19:H19,0))","v":0}]
["S-14",null,null,null,null,"None",0,0,{"$f":"SUM(ROUND(G20:H20,0))","v":0}]
["S-15",null,null,null,null,"None",0,0,{"$f":"SUM(ROUND(G21:H21,0))","v":0}]
["S-16",null,null,null,null,"None",0,0,{"$f":"SUM(ROUND(G22:H22,0))","v":0}]
["S-17",null,null,null,null,"None",0,0,{"$f":"SUM(ROUND(G23:H23,0))","v":0}]
["S-18",null,null,null,null,"None",0,0,{"$f":"SUM(ROUND(G24:H24,0))","v":0}]
["S-19",null,null,null,null,"None",0,0,{"$f":"SUM(ROUND(G25:H25,0))","v":0}]
["S-20",null,null,null,null,"None",0,0,{"$f":"SUM(ROUND(G26:H26,0))","v":0}]
["S-21",null,null,null,null,"None",0,0,{"$f":"SUM(ROUND(G27:H27,0))","v":0}]
["S-22",null,null,null,null,"None",0,0,{"$f":"SUM(ROUND(G28:H28,0))","v":0}]
["S-23",null,null,null,null,"None",0,0,{"$f":"SUM(ROUND(G29:H29,0))","v":0}]
["S-24",null,null,null,null,"None",0,0,{"$f":"SUM(ROUND(G30:H30,0))","v":0}]
["S-25",null,null,null,null,"None",0,0,{"$f":"SUM(ROUND(G31:H31,0))","v":0}]
["S-26",null,null,null,null,"None",0,0,{"$f":"SUM(ROUND(G32:H32,0))","v":0}]
["S-27",null,null,null,null,"None",0,0,{"$f":"SUM(ROUND(G33:H33,0))","v":0}]
["S-28",null,null,null,null,"None",0,0,{"$f":"SUM(ROUND(G34:H34,0))","v":0}]
["S-29",null,null,null,null,"None",0,0,{"$f":"SUM(ROUND(G35:H35,0))","v":0}]
["S-30",null,null,null,null,"None",0,0,{"$f":"SUM(ROUND(G36:H36,0))","v":0}]
["S-31",null,null,null,null,"None",0,0,{"$f":"SUM(ROUND(G37:H37,0))","v":0}]
["S-32",null,null,null,null,"None",0,0,{"$f":"SUM(ROUND(G38:H38,0))","v":0}]
["S-33",null,null,null,null,"None",0,0,{"$f":"SUM(ROUND(G39:H39,0))","v":0}]
["S-34",null,null,null,null,"None",0,0,{"$f":"SUM(ROUND(G40:H40,0))","v":0}]
["S-35",null,null,null,null,"None",0,0,{"$f":"SUM(ROUND(G41:H41,0))","v":0}]
["S-36",null,null,null,null,"None",0,0,{"$f":"SUM(ROUND(G42:H42,0))","v":0}]
["S-37",null,null,null,null,"None",0,0,{"$f":"SUM(ROUND(G43:H43,0))","v":0}]
["S-38",null,null,null,null,"None",0,0,{"$f":"SUM(ROUND(G44:H44,0))","v":0}]
["S-39",null,null,null,null,"None",0,0,{"$f":"SUM(ROUND(G45:H45,0))","v":0}]
["S-40",null,null,null,null,"None",0,0,{"$f":"SUM(ROUND(G46:H46,0))","v":0}]
["S-41",null,null,null,null,"None",0,0,{"$f":"SUM(ROUND(G47:H47,0))","v":0}]
["S-42",null,null,null,null,"None",0,0,{"$f":"SUM(ROUND(G48:H48,0))","v":0}]
["S-43",null,null,null,null,"None",0,0,{"$f":"SUM(ROUND(G49:H49,0))","v":0}]
["S-44",null,null,null,null,"None",0,0,{"$f":"SUM(ROUND(G50:H50,0))","v":0}]
["S-45",null,null,null,null,"None",0,0,{"$f":"SUM(ROUND(G51:H51,0))","v":0}]
["S-46",null,null,null,null,"None",0,0,{"$f":"SUM(ROUND(G52:H52,0))","v":0}]
["S-47",null,null,null,null,"None",0,0,{"$f":"SUM(ROUND(G53:H53,0))","v":0}]
["S-48",null,null,null,null,"None",0,0,{"$f":"SUM(ROUND(G54:H54,0))","v":0}]
["S-49",null,"CEC USE ONLY",null,null,"None",0,0,{"$f":"SUM(ROUND(G55:H55,0))","v":0}]
["S-50",null,"CEC USE ONLY",null,null,"None",0,0,{"$f":"SUM(ROUND(G56:H56,0))","v":0}]
["Subrecipient Totals",null,null,null,null,null,{"$f":"SUM(ROUND(G7:G56,0))","v":0},{"$f":"SUM(ROUND(H7:H56,0))","v":0},{"$f":"SUM(I7:I56)","v":0}]
[]
["Vendors"]
["Reference ID","Task #","Vendor\n(Please Use Legal Name)","Entity Number\n(CA Secretary of State)","Purpose","CA Business Certifications DVBE/ SB/MB/None","CEC\nShare","Match\nShare","Total"]
["V-1",null,null,null,null,"None",0,0,{"$f":"SUM(ROUND(G61:H61,0))","v":0}]
["V-2",null,null,null,null,"None",0,0,{"$f":"SUM(ROUND(G62:H62,0))","v":0}]
["V-3",null,null,null,null,"None",0,0,{"$f":"SUM(ROUND(G63:H63,0))","v":0}]
["V-4",null,null,null,null,"None",0,0,{"$f":"SUM(ROUND(G64:H64,0))","v":0}]
["V-5",null,null,null,null,"None",0,0,{"$f":"SUM(ROUND(G65:H65,0))","v":0}]
["V-6",null,null,null,null,"None",0,0,{"$f":"SUM(ROUND(G66:H66,0))","v":0}]
["V-7",null,null,null,null,"None",0,0,{"$f":"SUM(ROUND(G67:H67,0))","v":0}]
["V-8",null,null,null,null,"None",0,0,{"$f":"SUM(ROUND(G68:H68,0))","v":0}]
["V-9",null,null,null,null,"None",0,0,{"$f":"SUM(ROUND(G69:H69,0))","v":0}]
["V-10",null,null,null,null,"None",0,0,{"$f":"SUM(ROUND(G70:H70,0))","v":0}]
["V-11",null,null,null,null,"None",0,0,{"$f":"SUM(ROUND(G71:H71,0))","v":0}]
["V-12",null,null,null,null,"None",0,0,{"$f":"SUM(ROUND(G72:H72,0))","v":0}]
["V-13",null,null,null,null,"None",0,0,{"$f":"SUM(ROUND(G73:H73,0))","v":0}]
["V-14",null,null,null,null,"None",0,0,{"$f":"SUM(ROUND(G74:H74,0))","v":0}]
["V-15",null,null,null,null,"None",0,0,{"$f":"SUM(ROUND(G75:H75,0))","v":0}]
["V-16",null,null,null,null,"None",0,0,{"$f":"SUM(ROUND(G76:H76,0))","v":0}]
["V-17",null,null,null,null,"None",0,0,{"$f":"SUM(ROUND(G77:H77,0))","v":0}]
["V-18",null,null,null,null,"None",0,0,{"$f":"SUM(ROUND(G78:H78,0))","v":0}]
["V-19",null,null,null,null,"None",0,0,{"$f":"SUM(ROUND(G79:H79,0))","v":0}]
["V-20",null,null,null,null,"None",0,0,{"$f":"SUM(ROUND(G80:H80,0))","v":0}]
["V-21",null,null,null,null,"None",0,0,{"$f":"SUM(ROUND(G81:H81,0))","v":0}]
["V-22",null,null,null,null,"None",0,0,{"$f":"SUM(ROUND(G82:H82,0))","v":0}]
["V-23",null,null,null,null,"None",0,0,{"$f":"SUM(ROUND(G83:H83,0))","v":0}]
["V-24",null,null,null,null,"None",0,0,{"$f":"SUM(ROUND(G84:H84,0))","v":0}]
["V-25",null,null,null,null,"None",0,0,{"$f":"SUM(ROUND(G85:H85,0))","v":0}]
["V-26",null,null,null,null,"None",0,0,{"$f":"SUM(ROUND(G86:H86,0))","v":0}]
["V-27",null,null,null,null,"None",0,0,{"$f":"SUM(ROUND(G87:H87,0))","v":0}]
["V-28",null,null,null,null,"None",0,0,{"$f":"SUM(ROUND(G88:H88,0))","v":0}]
["V-29",null,null,null,null,"None",0,0,{"$f":"SUM(ROUND(G89:H89,0))","v":0}]
["V-30",null,null,null,null,"None",0,0,{"$f":"SUM(ROUND(G90:H90,0))","v":0}]
["V-31",null,null,null,null,"None",0,0,{"$f":"SUM(ROUND(G91:H91,0))","v":0}]
["V-32",null,null,null,null,"None",0,0,{"$f":"SUM(ROUND(G92:H92,0))","v":0}]
["V-33",null,null,null,null,"None",0,0,{"$f":"SUM(ROUND(G93:H93,0))","v":0}]
["V-34",null,null,null,null,"None",0,0,{"$f":"SUM(ROUND(G94:H94,0))","v":0}]
["V-35",null,null,null,null,"None",0,0,{"$f":"SUM(ROUND(G95:H95,0))","v":0}]
["V-36",null,null,null,null,"None",0,0,{"$f":"SUM(ROUND(G96:H96,0))","v":0}]
["V-37",null,null,null,null,"None",0,0,{"$f":"SUM(ROUND(G97:H97,0))","v":0}]
["V-38",null,null,null,null,"None",0,0,{"$f":"SUM(ROUND(G98:H98,0))","v":0}]
["V-39",null,null,null,null,"None",0,0,{"$f":"SUM(ROUND(G99:H99,0))","v":0}]
["V-40",null,null,null,null,"None",0,0,{"$f":"SUM(ROUND(G100:H100,0))","v":0}]
["V-41",null,null,null,null,"None",0,0,{"$f":"SUM(ROUND(G101:H101,0))","v":0}]
["V-42",null,null,null,null,"None",0,0,{"$f":"SUM(ROUND(G102:H102,0))","v":0}]
["V-43",null,null,null,null,"None",0,0,{"$f":"SUM(ROUND(G103:H103,0))","v":0}]
["V-44",null,null,null,null,"None",0,0,{"$f":"SUM(ROUND(G104:H104,0))","v":0}]
["V-45",null,null,null,null,"None",0,0,{"$f":"SUM(ROUND(G105:H105,0))","v":0}]
["V-46",null,null,null,null,"None",0,0,{"$f":"SUM(ROUND(G106:H106,0))","v":0}]
["V-47",null,null,null,null,"None",0,0,{"$f":"SUM(ROUND(G107:H107,0))","v":0}]
["V-48",null,null,null,null,"None",0,0,{"$f":"SUM(ROUND(G108:H108,0))","v":0}]
["V-49",null,"CEC USE ONLY",null,null,"None",0,0,{"$f":"SUM(ROUND(G109:H109,0))","v":0}]
["V-50",null,"CEC USE ONLY",null,null,"None",0,0,{"$f":"SUM(ROUND(G110:H110,0))","v":0}]
["Vendor Totals",null,null,null,null,null,{"$f":"SUM(ROUND(G61:G110,0))","v":0},{"$f":"SUM(ROUND(H61:H110,0))","v":0},{"$f":"SUM(I61:I110)","v":0}]
[]
["Subrecipients & Vendors Grand Totals"]
[null,null,null,null,null,null,"CEC\nShare","Match\nShare","Total"]
["Grand Totals",null,null,null,null,null,{"$f":"G57+G111","v":0},{"$f":"H57+H111","v":0},{"$f":"I57+I111","v":0}]

{"sheet":"Indirect Costs & Profit","index":8,"n_rows":163,"n_cols":17,"rows_kept":163,"cut":false,"hidden":false,"merged":[[150,0,150,1],[151,0,151,1],[149,0,149,11],[0,10,0,11],[158,0,158,8],[151,10,157,10],[151,11,157,11],[152,0,152,1],[153,0,153,1],[154,0,154,1],[155,0,155,1],[156,0,156,1],[157,0,157,1],[151,9,157,9],[151,7,157,7],[151,8,157,8],[151,5,157,5],[151,6,157,6],[151,4,157,4],[7,9,13,9],[7,10,13,10],[7,11,13,11],[7,0,13,0],[7,4,13,4],[7,5,13,5],[7,6,13,6],[140,6,146,6],[28,8,34,8],[28,9,34,9],[28,10,34,10],[28,11,34,11],[35,0,41,0],[35,4,41,4],[35,5,41,5],[35,6,41,6],[35,7,41,7],[35,8,41,8],[35,9,41,9],[35,10,41,10],[35,11,41,11],[28,0,34,0],[28,4,34,4],[140,8,146,8],[42,8,48,8],[42,9,48,9],[42,10,48,10],[42,11,48,11],[49,0,55,0],[2,0,2,11],[3,0,3,11],[4,0,4,11],[5,0,5,11],[14,6,20,6],[21,6,27,6],[14,11,20,11],[21,11,27,11],[14,0,20,0],[14,4,20,4],[14,7,20,7],[14,8,20,8],[14,9,20,9],[14,10,20,10],[21,0,27,0],[21,4,27,4],[21,7,27,7],[21,8,27,8],[21,9,27,9],[21,10,27,10],[14,5,20,5],[21,5,27,5],[7,7,13,7],[7,8,13,8],[49,4,55,4],[49,5,55,5],[49,6,55,6],[49,7,55,7],[49,8,55,8],[49,9,55,9],[49,10,55,10],[49,11,55,11],[42,0,48,0],[42,4,48,4],[42,5,48,5],[42,6,48,6],[42,7,48,7],[56,8,62,8],[56,9,62,9],[56,10,62,10],[56,11,62,11],[63,0,69,0],[63,4,69,4],[63,5,69,5],[63,6,69,6],[63,7,69,7],[63,8,69,8],[63,9,69,9],[63,10,69,10],[63,11,69,11],[56,0,62,0],[56,4,62,4],[56,5,62,5],[56,6,62,6],[56,7,62,7],[70,8,76,8],[70,9,76,9],[70,10,76,10],[70,11,76,11],[77,0,83,0],[77,4,83,4],[77,5,83,5],[77,6,83,6],[77,7,83,7],[77,8,83,8],[77,9,83,9],[77,10,83,10],[77,11,83,11],[70,0,76,0],[70,4,76,4],[70,5,76,5],[70,6,76,6],[70,7,76,7],[84,8,90,8],[84,9,90,9],[84,10,90,10],[84,11,90,11],[91,0,97,0],[91,4,97,4],[91,5,97,5],[91,6,97,6],[91,7,97,7],[91,8,97,8],[91,9,97,9],[91,10,97,10],[91,11,97,11],[84,0,90,0],[84,4,90,4],[84,5,90,5],[84,6,90,6],[84,7,90,7],[119,8,125,8],[119,9,125,9],[119,10,125,10],[119,11,125,11],[126,6,132,6],[126,7,132,7],[98,8,104,8],[98,9,104,9],[98,10,104,10],[98,11,104,11],[105,6,111,6],[105,7,111,7],[105,8,111,8],[105,9,111,9],[105,10,111,10],[105,11,111,11],[98,6,104,6],[98,7,104,7],[112,8,118,8],[112,9,118,9],[112,10,118,10],[112,11,118,11],[112,0,118,0],[112,4,118,4],[112,5,118,5],[112,6,118,6],[112,7,118,7],[140,0,146,0],[140,4,146,4],[140,7,146,7],[0,0,0,1],[119,0,125,0],[119,4,125,4],[119,5,125,5],[119,6,125,6],[119,7,125,7],[105,0,111,0],[105,4,111,4],[105,5,111,5],[98,0,104,0],[98,4,104,4],[98,5,104,5],[28,5,34,5],[28,6,34,6],[28,7,34,7],[1,0,1,11],[161,0,161,11],[162,0,162,11],[160,0,160,11],[126,8,132,8],[126,9,132,9],[126,10,132,10],[126,11,132,11],[133,0,139,0],[133,4,139,4],[133,5,139,5],[133,6,139,6],[133,7,139,7],[133,8,139,8],[133,9,139,9],[133,10,139,10],[133,11,139,11],[126,0,132,0],[126,4,132,4],[126,5,132,5],[140,9,146,9],[140,10,146,10],[140,11,146,11],[147,0,147,8],[140,5,146,5]]}
[{"$f":"'Category Budget'!$A$1","v":"Template Version 08/23/2021"},null,null,null,null,null,null,null,null,null,null,null,null,null,null,null,"SANDBOX AREA (highlighted in light red)- For rough work associated with the print area to the left.  Rough work may include, notes, calculations, derivations, etc."]
["PROPOSAL BUDGET"]
["Indirect Costs and Profit"]
[{"$f":"CONCATENATE('Category Budget'!$B$4,\":  \",'Category Budget'!$B$5)","v":"GFO-22-607:  Organization Name"}]
["Select an Indirect Cost Rate Option"]
["Indirect Cost(s)"]
["Name of Indirect Cost","Indirect Cost (IDC) Base Category","IDC Base\nCEC Share ($)","IDC Base\nMatch Share ($)","Total \nIDC Base\nCEC Share ($)","Total \nIDC Base\nMatch Share ($)","Total IDC Base ($)","IDC Rate (%)","Rate x Base ($)","CEC\nShare","Match\nShare","Total"]
[null,"Direct Labor",0,0,{"$f":"SUM(ROUND(C8,0),ROUND(C9,0),ROUND(C10,0),ROUND(C11,0),ROUND(C12,0),ROUND(C13,0),ROUND(C14,0))","v":0},{"$f":"SUM(ROUND(D8,0),ROUND(D9,0),ROUND(D10,0),ROUND(D11,0),ROUND(D12,0),ROUND(D13,0),ROUND(D14,0))","v":0},{"$f":"SUM(E8,F8)","v":0},0,{"$f":"ROUND($G8*H8,0)","v":0},0,0,{"$f":"ROUND($J8,0)+ROUND($K8,0)","v":0}]
[null,"Fringe Benefits",0,0]
[null,"Travel",0,0]
[null,"Equipment",0,0]
[null,"Materials/Misc.",0,0]
[null,"Subrecipients/Vendors",0,0]
[null,"Indirect Cost",0,0]
[null,"Direct Labor",0,0,{"$f":"SUM(ROUND(C15,0),ROUND(C16,0),ROUND(C17,0),ROUND(C18,0),ROUND(C19,0),ROUND(C20,0),ROUND(C21,0))","v":0},0,{"$f":"SUM(E15,F15)","v":0},0,{"$f":"ROUND($G15*H15,0)","v":0},0,0,{"$f":"ROUND($J15,0)+ROUND($K15,0)","v":0}]
[null,"Fringe Benefits",0,0]
[null,"Travel",0,0]
[null,"Equipment",0,0]
[null,"Materials/Misc.",0,0]
[null,"Subrecipients/Vendors",0,0]
[null,"Indirect Cost",0,0]
[null,"Direct Labor",0,0,{"$f":"SUM(ROUND(C22,0),ROUND(C23,0),ROUND(C24,0),ROUND(C25,0),ROUND(C26,0),ROUND(C27,0),ROUND(C28,0))","v":0},0,{"$f":"SUM(E22,F22)","v":0},0,{"$f":"ROUND($G22*H22,0)","v":0},0,0,{"$f":"ROUND($J22,0)+ROUND($K22,0)","v":0}]
[null,"Fringe Benefits",0,0]
[null,"Travel",0,0]
[null,"Equipment",0,0]
[null,"Materials/Misc.",0,0]
[null,"Subrecipients/Vendors",0,0]
[null,"Indirect Cost",0,0]
[null,"Direct Labor",0,0,{"$f":"SUM(ROUND(C29,0),ROUND(C30,0),ROUND(C31,0),ROUND(C32,0),ROUND(C33,0),ROUND(C34,0),ROUND(C35,0))","v":0},{"$f":"SUM(ROUND(D29,0),ROUND(D30,0),ROUND(D31,0),ROUND(D32,0),ROUND(D33,0),ROUND(D34,0),ROUND(D35,0))","v":0},{"$f":"SUM(E29,F29)","v":0},0,{"$f":"ROUND($G29*H29,0)","v":0},0,0,0]
[null,"Fringe Benefits",0,0]
[null,"Travel",0,0]
[null,"Equipment",0,0]
[null,"Materials/Misc.",0,0]
[null,"Subrecipients/Vendors",0,0]
[null,"Indirect Cost",0,0]
[null,"Direct Labor",0,0,{"$f":"SUM(ROUND(C36,0),ROUND(C37,0),ROUND(C38,0),ROUND(C39,0),ROUND(C40,0),ROUND(C41,0),ROUND(C42,0))","v":0},{"$f":"SUM(ROUND(D36,0),ROUND(D37,0),ROUND(D38,0),ROUND(D39,0),ROUND(D40,0),ROUND(D41,0),ROUND(D42,0))","v":0},{"$f":"SUM(E36,F36)","v":0},0,{"$f":"ROUND($G36*H36,0)","v":0},0,0,0]
[null,"Fringe Benefits",0,0]
[null,"Travel",0,0]
[null,"Equipment",0,0]
[null,"Materials/Misc.",0,0]
[null,"Subrecipients/Vendors",0,0]
[null,"Indirect Cost",0,0]
[null,"Direct Labor",0,0,{"$f":"SUM(ROUND(C43,0),ROUND(C44,0),ROUND(C45,0),ROUND(C46,0),ROUND(C47,0),ROUND(C48,0),ROUND(C49,0))","v":0},{"$f":"SUM(ROUND(D43,0),ROUND(D44,0),ROUND(D45,0),ROUND(D46,0),ROUND(D47,0),ROUND(D48,0),ROUND(D49,0))","v":0},{"$f":"SUM(E43,F43)","v":0},0,{"$f":"ROUND($G43*H43,0)","v":0},0,0,0]
[null,"Fringe Benefits",0,0]
[null,"Travel",0,0]
[null,"Equipment",0,0]
[null,"Materials/Misc.",0,0]
[null,"Subrecipients/Vendors",0,0]
[null,"Indirect Cost",0,0]
[null,"Direct Labor",0,0,{"$f":"SUM(ROUND(C50,0),ROUND(C51,0),ROUND(C52,0),ROUND(C53,0),ROUND(C54,0),ROUND(C55,0),ROUND(C56,0))","v":0},{"$f":"SUM(ROUND(D50,0),ROUND(D51,0),ROUND(D52,0),ROUND(D53,0),ROUND(D54,0),ROUND(D55,0),ROUND(D56,0))","v":0},{"$f":"SUM(E50,F50)","v":0},0,{"$f":"ROUND($G50*H50,0)","v":0},0,0,0]
[null,"Fringe Benefits",0,0]
[null,"Travel",0,0]
[null,"Equipment",0,0]
[null,"Materials/Misc.",0,0]
[null,"Subrecipients/Vendors",0,0]
[null,"Indirect Cost",0,0]
[null,"Direct Labor",0,0,{"$f":"SUM(ROUND(C57,0),ROUND(C58,0),ROUND(C59,0),ROUND(C60,0),ROUND(C61,0),ROUND(C62,0),ROUND(C63,0))","v":0},{"$f":"SUM(ROUND(D57,0),ROUND(D58,0),ROUND(D59,0),ROUND(D60,0),ROUND(D61,0),ROUND(D62,0),ROUND(D63,0))","v":0},{"$f":"SUM(E57,F57)","v":0},0,{"$f":"ROUND($G57*H57,0)","v":0},0,0,0]
[null,"Fringe Benefits",0,0]
[null,"Travel",0,0]
[null,"Equipment",0,0]
[null,"Materials/Misc.",0,0]
[null,"Subrecipients/Vendors",0,0]
[null,"Indirect Cost",0,0]
[null,"Direct Labor",0,0,{"$f":"SUM(ROUND(C64,0),ROUND(C65,0),ROUND(C66,0),ROUND(C67,0),ROUND(C68,0),ROUND(C69,0),ROUND(C70,0))","v":0},{"$f":"SUM(ROUND(D64,0),ROUND(D65,0),ROUND(D66,0),ROUND(D67,0),ROUND(D68,0),ROUND(D69,0),ROUND(D70,0))","v":0},{"$f":"SUM(E64,F64)","v":0},0,{"$f":"ROUND($G64*H64,0)","v":0},0,0,0]
[null,"Fringe Benefits",0,0]
[null,"Travel",0,0]
[null,"Equipment",0,0]
[null,"Materials/Misc.",0,0]
[null,"Subrecipients/Vendors",0,0]
[null,"Indirect Cost",0,0]
[null,"Direct Labor",0,0,{"$f":"SUM(ROUND(C71,0),ROUND(C72,0),ROUND(C73,0),ROUND(C74,0),ROUND(C75,0),ROUND(C76,0),ROUND(C77,0))","v":0},{"$f":"SUM(ROUND(D71,0),ROUND(D72,0),ROUND(D73,0),ROUND(D74,0),ROUND(D75,0),ROUND(D76,0),ROUND(D77,0))","v":0},{"$f":"SUM(E71,F71)","v":0},0,{"$f":"ROUND($G71*H71,0)","v":0},0,0,0]
[null,"Fringe Benefits",0,0]
[null,"Travel",0,0]
[null,"Equipment",0,0]
[null,"Materials/Misc.",0,0]
[null,"Subrecipients/Vendors",0,0]
[null,"Indirect Cost",0,0]
[null,"Direct Labor",0,0,{"$f":"SUM(ROUND(C78,0),ROUND(C79,0),ROUND(C80,0),ROUND(C81,0),ROUND(C82,0),ROUND(C83,0),ROUND(C84,0))","v":0},{"$f":"SUM(ROUND(D78,0),ROUND(D79,0),ROUND(D80,0),ROUND(D81,0),ROUND(D82,0),ROUND(D83,0),ROUND(D84,0))","v":0},{"$f":"SUM(E78,F78)","v":0},0,{"$f":"ROUND($G78*H78,0)","v":0},0,0,0]
[null,"Fringe Benefits",0,0]
[null,"Travel",0,0]
[null,"Equipment",0,0]
[null,"Materials/Misc.",0,0]
[null,"Subrecipients/Vendors",0,0]
[null,"Indirect Cost",0,0]
[null,"Direct Labor",0,0,{"$f":"SUM(ROUND(C85,0),ROUND(C86,0),ROUND(C87,0),ROUND(C88,0),ROUND(C89,0),ROUND(C90,0),ROUND(C91,0))","v":0},{"$f":"SUM(ROUND(D85,0),ROUND(D86,0),ROUND(D87,0),ROUND(D88,0),ROUND(D89,0),ROUND(D90,0),ROUND(D91,0))","v":0},{"$f":"SUM(E85,F85)","v":0},0,{"$f":"ROUND($G85*H85,0)","v":0},0,0,0]
[null,"Fringe Benefits",0,0]
[null,"Travel",0,0]
[null,"Equipment",0,0]
[null,"Materials/Misc.",0,0]
[null,"Subrecipients/Vendors",0,0]
[null,"Indirect Cost",0,0]
[null,"Direct Labor",0,0,{"$f":"SUM(ROUND(C92,0),ROUND(C93,0),ROUND(C94,0),ROUND(C95,0),ROUND(C96,0),ROUND(C97,0),ROUND(C98,0))","v":0},{"$f":"SUM(ROUND(D92,0),ROUND(D93,0),ROUND(D94,0),ROUND(D95,0),ROUND(D96,0),ROUND(D97,0),ROUND(D98,0))","v":0},{"$f":"SUM(E92,F92)","v":0},0,{"$f":"ROUND($G92*H92,0)","v":0},0,0,0]
[null,"Fringe Benefits",0,0]
[null,"Travel",0,0]
[null,"Equipment",0,0]
[null,"Materials/Misc.",0,0]
[null,"Subrecipients/Vendors",0,0]
[null,"Indirect Cost",0,0]
[null,"Direct Labor",0,0,{"$f":"SUM(ROUND(C99,0),ROUND(C100,0),ROUND(C101,0),ROUND(C102,0),ROUND(C103,0),ROUND(C104,0),ROUND(C105,0))","v":0},{"$f":"SUM(ROUND(D99,0),ROUND(D100,0),ROUND(D101,0),ROUND(D102,0),ROUND(D103,0),ROUND(D104,0),ROUND(D105,0))","v":0},{"$f":"SUM(E99,F99)","v":0},0,{"$f":"ROUND($G99*H99,0)","v":0},0,0,0]
[null,"Fringe Benefits",0,0]
[null,"Travel",0,0]
[null,"Equipment",0,0]
[null,"Materials/Misc.",0,0]
[null,"Subrecipients/Vendors",0,0]
[null,"Indirect Cost",0,0]
[null,"Direct Labor",0,0,{"$f":"SUM(ROUND(C106,0),ROUND(C107,0),ROUND(C108,0),ROUND(C109,0),ROUND(C110,0),ROUND(C111,0),ROUND(C112,0))","v":0},{"$f":"SUM(ROUND(D106,0),ROUND(D107,0),ROUND(D108,0),ROUND(D109,0),ROUND(D110,0),ROUND(D111,0),ROUND(D112,0))","v":0},{"$f":"SUM(E106,F106)","v":0},0,{"$f":"ROUND($G106*H106,0)","v":0},0,0,0]
[null,"Fringe Benefits",0,0]
[null,"Travel",0,0]
[null,"Equipment",0,0]
[null,"Materials/Misc.",0,0]
[null,"Subrecipients/Vendors",0,0]
[null,"Indirect Cost",0,0]
[null,"Direct Labor",0,0,{"$f":"SUM(ROUND(C113,0),ROUND(C114,0),ROUND(C115,0),ROUND(C116,0),ROUND(C117,0),ROUND(C118,0),ROUND(C119,0))","v":0},{"$f":"SUM(ROUND(D113,0),ROUND(D114,0),ROUND(D115,0),ROUND(D116,0),ROUND(D117,0),ROUND(D118,0),ROUND(D119,0))","v":0},{"$f":"SUM(E113,F113)","v":0},0,{"$f":"ROUND($G113*H113,0)","v":0},0,0,0]
[null,"Fringe Benefits",0,0]
[null,"Travel",0,0]
[null,"Equipment",0,0]
[null,"Materials/Misc.",0,0]
[null,"Subrecipients/Vendors",0,0]
[null,"Indirect Cost",0,0]
[null,"Direct Labor",0,0,{"$f":"SUM(ROUND(C120,0),ROUND(C121,0),ROUND(C122,0),ROUND(C123,0),ROUND(C124,0),ROUND(C125,0),ROUND(C126,0))","v":0},{"$f":"SUM(ROUND(D120,0),ROUND(D121,0),ROUND(D122,0),ROUND(D123,0),ROUND(D124,0),ROUND(D125,0),ROUND(D126,0))","v":0},{"$f":"SUM(E120,F120)","v":0},0,{"$f":"ROUND($G120*H120,0)","v":0},0,0,0]
[null,"Fringe Benefits",0,0]
[null,"Travel",0,0]
[null,"Equipment",0,0]
[null,"Materials/Misc.",0,0]
[null,"Subrecipients/Vendors",0,0]
[null,"Indirect Cost",0,0]
[null,"Direct Labor",0,0,{"$f":"SUM(ROUND(C127,0),ROUND(C128,0),ROUND(C129,0),ROUND(C130,0),ROUND(C131,0),ROUND(C132,0),ROUND(C133,0))","v":0},{"$f":"SUM(ROUND(D127,0),ROUND(D128,0),ROUND(D129,0),ROUND(D130,0),ROUND(D131,0),ROUND(D132,0),ROUND(D133,0))","v":0},{"$f":"SUM(E127,F127)","v":0},0,{"$f":"ROUND($G127*H127,0)","v":0},0,0,0]
[null,"Fringe Benefits",0,0]
[null,"Travel",0,0]
[null,"Equipment",0,0]
[null,"Materials/Misc.",0,0]
[null,"Subrecipients/Vendors",0,0]
[null,"Indirect Cost",0,0]
["CEC USE ONLY","Direct Labor",0,0,{"$f":"SUM(ROUND(C134,0),ROUND(C135,0),ROUND(C136,0),ROUND(C137,0),ROUND(C138,0),ROUND(C139,0),ROUND(C140,0))","v":0},{"$f":"SUM(ROUND(D134,0),ROUND(D135,0),ROUND(D136,0),ROUND(D137,0),ROUND(D138,0),ROUND(D139,0),ROUND(D140,0))","v":0},{"$f":"SUM(E134,F134)","v":0},0,{"$f":"ROUND($G134*H134,0)","v":0},0,0,{"$f":"ROUND($J134,0)+ROUND($K134,0)","v":0}]
[null,"Fringe Benefits",0,0]
[null,"Travel",0,0]
[null,"Equipment",0,0]
[null,"Materials/Misc.",0,0]
[null,"Subrecipients/Vendors",0,0]
[null,"Indirect Cost",0,0]
["CEC USE ONLY","Direct Labor",0,0,{"$f":"SUM(ROUND(C141,0),ROUND(C142,0),ROUND(C143,0),ROUND(C144,0),ROUND(C145,0),ROUND(C146,0),ROUND(C147,0))","v":0},{"$f":"SUM(ROUND(D141,0),ROUND(D142,0),ROUND(D143,0),ROUND(D144,0),ROUND(D145,0),ROUND(D146,0),ROUND(D147,0))","v":0},{"$f":"SUM(E141,F141)","v":0},0,{"$f":"ROUND($G141*H141,0)","v":0},0,0,{"$f":"ROUND($J141,0)+ROUND($K141,0)","v":0}]
[null,"Fringe Benefits",0,0]
[null,"Travel",0,0]
[null,"Equipment",0,0]
[null,"Materials/Misc.",0,0]
[null,"Subrecipients/Vendors",0,0]
[null,"Indirect Cost",0,0]
["Indirect Costs Grand Totals ",null,null,null,null,null,null,null,null,{"$f":"SUM(ROUND(J8:J147,0))","v":0},{"$f":"SUM(ROUND(K8:K147,0))","v":0},{"$f":"SUM(L8:L147)","v":0}]
[]
["Profit"]
["Profit Base Categories",null,"Profit Base\nCEC Share ($)","Profit Base\nMatch Share ($)","Total \nProfit Base\nCEC Share ($)","Total \nProfit Base\nMatch Share ($)","Total Profit Base ($)","Profit Rate (%)","Rate x Base ($)","CEC\nShare","Match\nShare","Total"]
["Direct Labor",null,0,0,{"$f":"SUM(ROUND(C152,0),ROUND(C153,0),ROUND(C154,0),ROUND(C155,0),ROUND(C156,0),ROUND(C157,0),ROUND(C158,0))","v":0},{"$f":"SUM(ROUND(D152,0),ROUND(D153,0),ROUND(D154,0),ROUND(D155,0),ROUND(D156,0),ROUND(D157,0),ROUND(D158,0))","v":0},{"$f":"SUM(E152,F152)","v":0},0,{"$f":"ROUND($G152*H152,0)","v":0},0,0,{"$f":"ROUND($J152,0)+ROUND($K152,0)","v":0}]
["Fringe Benefits",null,0,0]
["Travel",null,0,0]
["Equipment",null,0,0]
["Materials/Misc.",null,0,0]
["Subrecipients/Vendors",null,0,0]
["Indirect Cost",null,0,0]
["Profit Grand Totals ",null,null,null,null,null,null,null,null,{"$f":"SUM(ROUND(J152,0))","v":0},{"$f":"SUM(ROUND(K152,0))","v":0},{"$f":"SUM(L152)","v":0}]
[]
["Worksheet Specific Instructions"]
["CONDITIONAL FORMATTING APPLIED:  If the CEC Share value is greater than the Total IDC Base CEC Share ($) multiplied by the IDC Rate (%), as indicated by red conditional formatting (dark red text, light red fill), then the budget will have to be corrected and the Recipient notified that the CEC does not pay for Indirect Costs (IDCs) on IDC Base Amounts charged as Match Share expenses."]
["CONDITIONAL FORMATTING APPLIED:  If the CEC Share value is greater than the Total Profit Base CEC Share ($) multiplied by the Profit Rate (%), as indicated by red conditional formatting (dark red text, light red fill), then the budget will have to be corrected and the Recipient notified that the CEC does not pay for Profit on Profit Base Amounts charged as Match Share expenses."]

{"sheet":"Lists","index":9,"n_rows":23,"n_cols":1,"rows_kept":23,"cut":false,"hidden":true,"merged":[]}
[{"$f":"'Category Budget'!$A$1","v":"Template Version 08/23/2021"}]
["Recipient/Subrecipient"]
["Select Recipient or Subrecipient"]
["Recipient"]
["Subrecipient"]
[]
[]
["CA Business Certifications"]
["Select your company's California Business Certifications"]
["Small Business"]
["Micro Business"]
["Disabled Veteran Business Enterprise (DVBE)"]
["Small Business and Micro Business"]
["Small Business and Disabled Veteran Business Enterprise (DVBE)"]
["Micro Business and Disabled Veteran Business Enterprise (DVBE)"]
["None"]
[]
[]
["Indirect Cost Options"]
["Select an Indirect Cost Rate Option"]
["DCAA Rate"]
["CEC De Minimis Rate"]
["Recipient's Rate (From Cost Allocation Plan)"]